{"text_format":"3","workbook":"xlsx","n_sheets":8,"sheets":["Nacional","Asistencias","Internacional","D.Nacionales","D.Extranjeras","Personal","Municipios","Distancias"],"not_rendered":{"images":2,"defined_names":6,"comments":2},"read":"whole","date_system":"1900"}

{"sheet":"Nacional","index":0,"n_rows":89,"n_cols":13,"rows_kept":89,"merged":[[1,2,6,2],[1,3,2,6],[3,3,4,6],[5,3,6,6],[8,0,8,6],[9,0,9,6],[11,1,11,3],[12,1,12,6],[13,1,13,3],[13,5,13,6],[14,0,14,1],[14,2,14,6],[16,2,16,6],[18,0,19,6],[21,0,21,3],[21,5,25,6],[24,0,24,3],[34,0,34,2],[34,3,34,4],[34,5,34,6],[48,3,49,6],[56,3,56,5],[58,3,59,6],[66,3,67,6],[68,3,73,6],[75,4,75,6],[78,4,78,6],[79,2,80,2],[79,4,79,6],[81,3,82,6],[82,2,83,2],[84,4,84,6],[88,4,88,6]]}
[]
[null,null,"Descripción de la(s) Unidad(es) de Gasto"]
[]
[]
[]
[]
[]
[]
["CUENTA JUSTIFICATIVA PARA LA LIQUIDACIÓN DE COMISIONES DE SERVICIO"]
["Dietas nacionales - Personal Externo"]
[]
["Nombre:",{"$nulls":3},"D.N.I. o Pasaporte:"]
["Domicilio:"]
["Localidad y Código Postal:",{"$nulls":3},"Teléfono:"]
["Código Internacional de Cuenta Bancaria IBAN:"]
[]
["Grupo:",null,{"$f":"IF(OR(B12=\"\",B17=\"\")=TRUE,\"Cumplimente el nombre y el grupo de la persona comisionada\",\"\")","v":"Cumplimente el nombre y el grupo de la persona comisionada"}]
["Descripción de la comisión:"]
[]
[]
[]
["Inicio",{"$nulls":4},{"$f":"IF(B23=\"\",\"Cumplimente la fecha inicio de la comisión\",IF(D23=\"\",\"Cumplimente la hora inicio de la comisión\",IF(B26<B23,IF(B26=\"\",\"Cumplimente la fecha fin de la comisión\",\"Revise la fecha fin de la comisión, ésta no puede ser menor que la de inicio\"),IF(B26=B23,IF(D26<D23,IF(D26=\"\",\"Cumplimente la hora fin de la comisión\",\"Revise la hora fin de la comisión, ésta no puede ser menor que la de inicio\"),\"\"),IF(D26=\"\",\"Cumplimente la hora fin de la comisión\",\"\")))))","v":"Cumplimente la fecha inicio de la comisión"},{"$nulls":3},"Diferencia horas:",{"$f":"IF(AND(D23<>\"\",D26<>\"\",B30=1)=TRUE,D26-D23,\"\")","v":""}]
["Fecha (dd/mm/aa)",null,"Hora (hh:mm):",{"$nulls":6},"Mínimo:","04:59:59"]
[{"$nulls":9},"Inicio","14:00:01"]
["Fin",{"$nulls":3},"Cena",{"$nulls":4},"Duración","04:59:59"]
["Fecha (dd/mm/aa)",null,"Hora (hh:mm):",null,"No",{"$nulls":4},"Dieta 1 Dia:",{"$f":"IF(B30=1,IF(AND(K22>K23,D23<K24,D26>K29)=TRUE,0.5,0),\"\")","v":""}]
[]
["Vehículo particular",null,"Matrícula"]
[{"$nulls":9},"Límite fin","16:00:00"]
["Duración de la comisión:",{"$f":"IF(AND(B23<>\"\",B26<>\"\")=TRUE,B26-B23+1,\"\")","v":""},{"$nulls":7},"Hora inicio:","22:00:00","13:59:59"]
["Dietas máximas:",{"$nulls":8},"Dieta Inicio:",{"$f":"IF(D23>K30,-1,IF(D23>L30,-0.5,0))","v":0}]
["Dietas devengadas:"]
[{"$nulls":9},"Hora fin","22:00:00","14:00:00","13:59:59"]
[]
["Declaración de itinerario (indicar obligatoriamente)",null,null,"Salida",null,"Llegada",{"$nulls":3},"Dieta fin",{"$f":"IF(AND(D26>K33,E26=\"Sí\")=TRUE,0,IF(D26>M33,-0.5,IF(D26<L33,-1)))","v":-1}]
["De:","A:","Kms. (sólo si vehículo particular)","Día","Hora","Día","Hora"]
[null,null,{"$f":"IF($B$28=\"SÍ\",IF(AND(A37<>\"\",B37<>\"\")=TRUE,SUMIF(Distancias!C:C,CONCATENATE(A37,\"-hasta-\",B37),Distancias!D:D),\"\"),\"\")","v":""},{"$nulls":6},"Dieta + 1 Día:",{"$f":"IF(B30>1,B30+K31+K35,\"\")","v":{"$error":"#VALUE!"}}]
[null,null,{"$f":"IF($B$28=\"SÍ\",IF(AND(A38<>\"\",B38<>\"\")=TRUE,SUMIF(Distancias!C:C,CONCATENATE(A38,\"-hasta-\",B38),Distancias!D:D),\"\"),\"\")","v":""}]
[null,null,{"$f":"IF($B$28=\"SÍ\",IF(AND(A39<>\"\",B39<>\"\")=TRUE,SUMIF(Distancias!C:C,CONCATENATE(A39,\"-hasta-\",B39),Distancias!D:D),\"\"),\"\")","v":""}]
[null,null,{"$f":"IF($B$28=\"SÍ\",IF(AND(A40<>\"\",B40<>\"\")=TRUE,SUMIF(Distancias!C:C,CONCATENATE(A40,\"-hasta-\",B40),Distancias!D:D),\"\"),\"\")","v":""}]
{"$rows_left_out":50}
{"sheet":"Asistencias","index":1,"n_rows":7,"n_cols":4,"rows_kept":7,"hidden":true}
["Perfil","Categoría","Clave","Importe"]
["Presidente y Secretario","Primera",{"$f":"CONCATENATE(A2,\"-\",B2)","v":"Presidente y Secretario-Primera"},{"v":45.89,"d":"45.89 "}]
["Vocales","Primera","Vocales-Primera",{"v":42.83,"d":"42.83 "}]
["Presidente y Secretario","Segunda","Presidente y Secretario-Segunda",{"v":42.83,"d":"42.83 "}]
["Vocales","Segunda","Vocales-Segunda",{"v":39.78,"d":"39.78 "}]
["Presidente y Secretario","Tercera","Presidente y Secretario-Tercera",{"v":39.78,"d":"39.78 "}]
["Vocales","Tercera","Vocales-Tercera",{"v":36.72,"d":"36.72 "}]

{"sheet":"Internacional","index":2,"n_rows":127,"n_cols":30,"rows_kept":127,"hidden":true,"merged":[[5,0,7,6],[9,1,9,4],[12,0,13,6],[15,1,15,3],[17,0,17,3],[19,0,19,3],[21,0,21,3],[23,0,23,3],[37,0,37,3],[51,0,51,3],[64,3,64,6],[65,3,65,6],[68,0,68,2],[68,3,68,4],[68,5,68,6],[82,2,82,3],[96,0,96,2],[98,3,99,6],[100,3,101,6],[105,3,106,6],[108,4,108,6],[113,4,113,6],[117,3,118,6],[120,4,120,6],[125,4,125,6]]}
[]
[]
[]
[]
[]
["CUENTA JUSTIFICATIVA PARA LA LIQUIDACIÓN DE COMISIONES DE SERVICIO INTERNACIONALES"]
[]
[]
[]
["Nombre:"]
["Grupo:"]
["Descripción de la comisión:"]
[]
[]
[]
["País:"]
[{"$nulls":28},"Inicio Nacional",{"$f":"B21-B19+1+Y29+Y32","v":0}]
["Inicio",{"$nulls":22},"Diferencia horas:",{"$f":"IF(AND(D19<>\"\",D21<>\"\",B27=1)=TRUE,D21-D19,\"\")","v":""}]
["Fecha (dd/mm/aa)",null,"Hora (hh:mm):",{"$nulls":20},"Mínimo:","04:59:59",{"$nulls":3},"Extranjera",{"$f":"B23-B39+1+Y45+Y46","v":0}]
["Salida de España"]
["Fecha (dd/mm/aa)",null,"Hora (hh:mm):"]
["Entrada en España"]
["Fecha (dd/mm/aa)",null,"Hora (hh:mm):",{"$nulls":20},"Inicio","14:00:01"]
["Fin",{"$nulls":3},"Cena",{"$nulls":17},"Cena","Fin","04:59:59",{"$nulls":3},"Fin Nacional",{"$f":"B25-B53+1+Y59+Y61","v":0}]
["Fecha (dd/mm/aa)",null,"Hora (hh:mm):",null,"No",{"$nulls":17},"No","Dieta 1 Dia:",{"$f":"IF(B27=1,IF(AND(Y18>Y19,D19<Y23,D21>Y24)=TRUE,0.5,0),\"\")","v":""}]
[]
["Duración total de la comisión:",{"$f":"IF(AND(B19<>\"\",B25<>\"\")=TRUE,B25-B19+1,\"\")","v":""},{"$nulls":21},"Hora inicio:","22:00:00","13:59:59"]
["Duración de la comisión nacional:",{"$f":"B21-B19+B25-B53","v":0}]
["Dietas máximas:",{"$f":"IF(B27=1,Y25,Y36)","v":{"$error":"#VALUE!"}},{"$nulls":21},"Dieta Inicio Nacional:",{"$f":"IF(D19>Y27,-1,IF(D19>Z27,-0.5,0))","v":0}]
["Dietas devengadas:",1]
["Duración de la comisión inter:",{"$f":"B23-B39+1","v":1},{"$nulls":21},"Hora fin","22:00:00","14:00:00","13:59:59"]
["Dietas máximas inter:",{"$f":"IF(B31=1,Y42,Y49)","v":0},{"$nulls":21},"Dieta fin Nacional",{"$f":"IF(AND(D21>Y31,W25=\"Sí\")=TRUE,0,IF(D21>AA31,-0.5,IF(D21<Z31,-1)))","v":-1}]
["Dietas devengadas inter:",1]
["Alojamiento nacional",{"$f":"B21-B19+B25-B53","v":0}]
["Alojamiento internacional",{"$f":"B23-B21","v":0}]
[{"$nulls":23},"Dieta + 1 Día:",{"$f":"IF(B27>1,B27+Y29+Y32,\"\")","v":{"$error":"#VALUE!"}}]
[]
["Salida de España",{"$nulls":22},"Diferencia horas:",{"$f":"IF(AND(D39<>\"\",D23<>\"\",B31=1)=TRUE,D23-D39,\"\")","v":""}]
["Fecha (dd/mm/aa)",{"$f":"B21","v":"00:00:00"},"Hora (hh:mm):",{"$f":"D21+Y66","v":"00:00:00"},{"$nulls":19},"Mínimo:","04:59:59"]
[{"$nulls":23},"Inicio","14:00:01"]
{"$rows_left_out":80}
{"sheet":"D.Nacionales","index":3,"n_rows":5,"n_cols":7,"rows_kept":5,"hidden":true}
["Grupo","Descripción","Manutencion","Alojamiento","Kilometraje","Kilom. Exento","Kilom. IRPF"]
["1","Rector, Vicerrectores, Sec. Gral., Gerente, Vicegerentes, Adjuntos al Rector, Decanos de Facultad o Directores de Escuela y Directores de Departamento",{"v":53.34,"d":"53.34 "},{"v":102.56,"d":"102.56 "},0.22,0.19,0.03]
["2","PDI y PAS de la UR pertenecientes a los cuerpos o escalas clasificados en los grupos A y B, así como personal laboral clasificados en los grupos I y II, y personal de otras administraciones públicas asimilados a los anteriores",{"v":37.4,"d":"37.40 "},{"v":65.97,"d":"65.97 "},0.22,0.19,0.03]
["3","PAS de la UR pertenecientes a los cuerpos o escalas clasificados en los grupos C, D y E, así como al p.laboral de adm.y serv. pertenecientes a los grupos III, IVA y IVB, y personal de otras administraciones públicas asimilados a los anteriores",{"v":28.21,"d":"28.21 "},{"v":48.92,"d":"48.92 "},0.22,0.19,0.03]
["4","Otro personal",{"v":37.4,"d":"37.40 "},{"v":65.97,"d":"65.97 "},0.22,0.19,0.03]

{"sheet":"D.Extranjeras","index":4,"n_rows":100,"n_cols":9,"rows_kept":100,"hidden":true,"merged":[[0,1,0,4],[0,5,0,8]]}
[null,"Manutención",{"$nulls":3},"Alojamiento"]
["País","1","2","3","4","1","2","3","4"]
["Alemania",{"v":68.52,"d":"68.52 "},{"v":59.5,"d":"59.50 "},{"v":55.5,"d":"55.50 "},{"$f":"C3","v":{"v":59.5,"d":"59.50 "}},{"v":155.66,"d":"155.66 "},{"v":132.82,"d":"132.82 "},{"v":117.2,"d":"117.20 "},{"$f":"G3","v":{"v":132.82,"d":"132.82 "}}]
["Andorra",{"v":44.47,"d":"44.47 "},{"v":37.86,"d":"37.86 "},{"v":34.86,"d":"34.86 "},{"$f":"C4","v":{"v":37.86,"d":"37.86 "}},{"v":54.69,"d":"54.69 "},{"v":46.88,"d":"46.88 "},{"v":41.47,"d":"41.47 "},{"$f":"G4","v":{"v":46.88,"d":"46.88 "}}]
["Angola",{"v":66.71,"d":"66.71 "},{"v":59.5,"d":"59.50 "},{"v":55.89,"d":"55.89 "},{"v":59.5,"d":"59.50 "},{"v":158.67,"d":"158.67 "},{"v":135.23,"d":"135.23 "},{"v":119,"d":"119.00 "},{"v":135.23,"d":"135.23 "}]
["Arabia Saudita",{"v":60.7,"d":"60.70 "},{"v":54.09,"d":"54.09 "},{"v":50.49,"d":"50.49 "},{"v":54.09,"d":"54.09 "},{"v":86.55,"d":"86.55 "},{"v":73.92,"d":"73.92 "},{"v":64.91,"d":"64.91 "},{"v":73.92,"d":"73.92 "}]
["Argelia",{"v":51.09,"d":"51.09 "},{"v":44.47,"d":"44.47 "},{"v":42.07,"d":"42.07 "},{"v":44.47,"d":"44.47 "},{"v":119,"d":"119.00 "},{"v":101.57,"d":"101.57 "},{"v":89.55,"d":"89.55 "},{"v":101.57,"d":"101.57 "}]
["Argentina",{"v":64.91,"d":"64.91 "},{"v":55.29,"d":"55.29 "},{"v":50.49,"d":"50.49 "},{"v":55.29,"d":"55.29 "},{"v":130.42,"d":"130.42 "},{"v":111.19,"d":"111.19 "},{"v":97.96,"d":"97.96 "},{"v":111.19,"d":"111.19 "}]
["Australia",{"v":57.1,"d":"57.10 "},{"v":51.09,"d":"51.09 "},{"v":48.08,"d":"48.08 "},{"v":51.09,"d":"51.09 "},{"v":94.96,"d":"94.96 "},{"v":81.14,"d":"81.14 "},{"v":71.52,"d":"71.52 "},{"v":81.14,"d":"81.14 "}]
["Austria",{"v":66.11,"d":"66.11 "},{"v":58.9,"d":"58.90 "},{"v":55.29,"d":"55.29 "},{"v":58.9,"d":"58.90 "},{"v":112.39,"d":"112.39 "},{"v":95.56,"d":"95.56 "},{"v":84.74,"d":"84.74 "},{"v":95.56,"d":"95.56 "}]
["Bélgica",{"v":91.35,"d":"91.35 "},{"v":82.94,"d":"82.94 "},{"v":78.73,"d":"78.73 "},{"v":82.94,"d":"82.94 "},{"v":174.29,"d":"174.29 "},{"v":148.45,"d":"148.45 "},{"v":131.02,"d":"131.02 "},{"v":148.45,"d":"148.45 "}]
["Bolivia",{"v":42.67,"d":"42.67 "},{"v":36.66,"d":"36.66 "},{"v":33.66,"d":"33.66 "},{"v":36.66,"d":"36.66 "},{"v":60.1,"d":"60.10 "},{"v":51.09,"d":"51.09 "},{"v":45.08,"d":"45.08 "},{"v":51.09,"d":"51.09 "}]
["Bosnia-Herzegovina",{"v":57.7,"d":"57.70 "},{"v":49.88,"d":"49.88 "},{"v":45.68,"d":"45.68 "},{"v":49.88,"d":"49.88 "},{"v":85.34,"d":"85.34 "},{"v":72.72,"d":"72.72 "},{"v":64.31,"d":"64.31 "},{"v":72.72,"d":"72.72 "}]
["Brasil",{"v":91.35,"d":"91.35 "},{"v":79.33,"d":"79.33 "},{"v":74.53,"d":"74.53 "},{"v":79.33,"d":"79.33 "},{"v":150.25,"d":"150.25 "},{"v":128.02,"d":"128.02 "},{"v":112.99,"d":"112.99 "},{"v":128.02,"d":"128.02 "}]
["Bulgaria",{"v":44.47,"d":"44.47 "},{"v":37.86,"d":"37.86 "},{"v":35.46,"d":"35.46 "},{"v":37.86,"d":"37.86 "},{"v":62.51,"d":"62.51 "},{"v":53.49,"d":"53.49 "},{"v":46.88,"d":"46.88 "},{"v":53.49,"d":"53.49 "}]
["Camerún",{"v":55.29,"d":"55.29 "},{"v":48.68,"d":"48.68 "},{"v":45.68,"d":"45.68 "},{"v":48.68,"d":"48.68 "},{"v":103.37,"d":"103.37 "},{"v":88.35,"d":"88.35 "},{"v":77.53,"d":"77.53 "},{"v":88.35,"d":"88.35 "}]
["Canadá",{"v":58.3,"d":"58.30 "},{"v":51.69,"d":"51.69 "},{"v":48.68,"d":"48.68 "},{"v":51.69,"d":"51.69 "},{"v":110.59,"d":"110.59 "},{"v":94.36,"d":"94.36 "},{"v":82.94,"d":"82.94 "},{"v":94.36,"d":"94.36 "}]
["Chile",{"v":57.7,"d":"57.70 "},{"v":50.49,"d":"50.49 "},{"v":46.88,"d":"46.88 "},{"v":50.49,"d":"50.49 "},{"v":120.2,"d":"120.20 "},{"v":102.17,"d":"102.17 "},{"v":90.15,"d":"90.15 "},{"v":102.17,"d":"102.17 "}]
["China",{"v":51.69,"d":"51.69 "},{"v":46.28,"d":"46.28 "},{"v":43.27,"d":"43.27 "},{"v":46.28,"d":"46.28 "},{"v":84.14,"d":"84.14 "},{"v":71.52,"d":"71.52 "},{"v":63.11,"d":"63.11 "},{"v":71.52,"d":"71.52 "}]
["Colombia",{"v":90.15,"d":"90.15 "},{"v":78.13,"d":"78.13 "},{"v":73.32,"d":"73.32 "},{"v":78.13,"d":"78.13 "},{"v":145.44,"d":"145.44 "},{"v":123.81,"d":"123.81 "},{"v":109.38,"d":"109.38 "},{"v":123.81,"d":"123.81 "}]
["Corea",{"v":62.51,"d":"62.51 "},{"v":55.29,"d":"55.29 "},{"v":52.89,"d":"52.89 "},{"v":55.29,"d":"55.29 "},{"v":120.2,"d":"120.20 "},{"v":102.17,"d":"102.17 "},{"v":90.15,"d":"90.15 "},{"v":102.17,"d":"102.17 "}]
["Costa de Marfil",{"v":55.89,"d":"55.89 "},{"v":49.28,"d":"49.28 "},{"v":46.28,"d":"46.28 "},{"v":49.28,"d":"49.28 "},{"v":72.12,"d":"72.12 "},{"v":61.3,"d":"61.30 "},{"v":54.09,"d":"54.09 "},{"v":61.3,"d":"61.30 "}]
["Costa Rica",{"v":52.29,"d":"52.29 "},{"v":44.47,"d":"44.47 "},{"v":40.87,"d":"40.87 "},{"v":44.47,"d":"44.47 "},{"v":76.93,"d":"76.93 "},{"v":65.51,"d":"65.51 "},{"v":57.7,"d":"57.70 "},{"v":65.51,"d":"65.51 "}]
["Croacia",{"v":57.7,"d":"57.70 "},{"v":49.88,"d":"49.88 "},{"v":45.68,"d":"45.68 "},{"v":49.88,"d":"49.88 "},{"v":85.34,"d":"85.34 "},{"v":72.72,"d":"72.72 "},{"v":64.31,"d":"64.31 "},{"v":72.72,"d":"72.72 "}]
["Cuba",{"v":38.46,"d":"38.46 "},{"v":33.06,"d":"33.06 "},{"v":29.45,"d":"29.45 "},{"v":33.06,"d":"33.06 "},{"v":66.11,"d":"66.11 "},{"v":56.5,"d":"56.50 "},{"v":49.88,"d":"49.88 "},{"v":56.5,"d":"56.50 "}]
["Dinamarca",{"v":72.12,"d":"72.12 "},{"v":64.91,"d":"64.91 "},{"v":62.51,"d":"62.51 "},{"v":64.91,"d":"64.91 "},{"v":144.24,"d":"144.24 "},{"v":122.61,"d":"122.61 "},{"v":108.18,"d":"108.18 "},{"v":122.61,"d":"122.61 "}]
["R. Dominicana",{"v":42.07,"d":"42.07 "},{"v":36.66,"d":"36.66 "},{"v":34.26,"d":"34.26 "},{"v":36.66,"d":"36.66 "},{"v":75.13,"d":"75.13 "},{"v":64.31,"d":"64.31 "},{"v":56.5,"d":"56.50 "},{"v":64.31,"d":"64.31 "}]
["Ecuador",{"v":50.49,"d":"50.49 "},{"v":43.27,"d":"43.27 "},{"v":39.67,"d":"39.67 "},{"v":43.27,"d":"43.27 "},{"v":75.73,"d":"75.73 "},{"v":64.91,"d":"64.91 "},{"v":57.1,"d":"57.10 "},{"v":64.91,"d":"64.91 "}]
["Egipto",{"v":44.47,"d":"44.47 "},{"v":39.07,"d":"39.07 "},{"v":36.66,"d":"36.66 "},{"v":39.07,"d":"39.07 "},{"v":106.98,"d":"106.98 "},{"v":91.35,"d":"91.35 "},{"v":80.54,"d":"80.54 "},{"v":91.35,"d":"91.35 "}]
["El Salvador",{"v":50.49,"d":"50.49 "},{"v":43.27,"d":"43.27 "},{"v":39.67,"d":"39.67 "},{"v":43.27,"d":"43.27 "},{"v":77.53,"d":"77.53 "},{"v":66.11,"d":"66.11 "},{"v":58.3,"d":"58.30 "},{"v":66.11,"d":"66.11 "}]
["Emiratos Árabes Unidos",{"v":63.71,"d":"63.71 "},{"v":56.5,"d":"56.50 "},{"v":52.89,"d":"52.89 "},{"v":56.5,"d":"56.50 "},{"v":119,"d":"119.00 "},{"v":101.57,"d":"101.57 "},{"v":89.55,"d":"89.55 "},{"v":101.57,"d":"101.57 "}]
["Eslovaquia",{"v":49.88,"d":"49.88 "},{"v":43.27,"d":"43.27 "},{"v":40.87,"d":"40.87 "},{"v":43.27,"d":"43.27 "},{"v":88.95,"d":"88.95 "},{"v":75.73,"d":"75.73 "},{"v":66.71,"d":"66.71 "},{"v":75.73,"d":"75.73 "}]
["Estados Unidos",{"v":77.53,"d":"77.53 "},{"v":69.72,"d":"69.72 "},{"v":66.11,"d":"66.11 "},{"v":69.72,"d":"69.72 "},{"v":168.28,"d":"168.28 "},{"v":143.04,"d":"143.04 "},{"v":126.21,"d":"126.21 "},{"v":143.04,"d":"143.04 "}]
["Etiopía",{"v":43.87,"d":"43.87 "},{"v":37.86,"d":"37.86 "},{"v":34.86,"d":"34.86 "},{"v":37.86,"d":"37.86 "},{"v":140.04,"d":"140.04 "},{"v":119.6,"d":"119.60 "},{"v":105.18,"d":"105.18 "},{"v":119.6,"d":"119.60 "}]
["Filipinas",{"v":45.08,"d":"45.08 "},{"v":39.67,"d":"39.67 "},{"v":36.66,"d":"36.66 "},{"v":39.67,"d":"39.67 "},{"v":84.14,"d":"84.14 "},{"v":71.52,"d":"71.52 "},{"v":63.11,"d":"63.11 "},{"v":71.52,"d":"71.52 "}]
["Finlandia",{"v":72.72,"d":"72.72 "},{"v":65.51,"d":"65.51 "},{"v":62.51,"d":"62.51 "},{"v":65.51,"d":"65.51 "},{"v":134.63,"d":"134.63 "},{"v":114.79,"d":"114.79 "},{"v":100.97,"d":"100.97 "},{"v":114.79,"d":"114.79 "}]
["Francia",{"v":72.72,"d":"72.72 "},{"v":65.51,"d":"65.51 "},{"v":61.9,"d":"61.90 "},{"v":65.51,"d":"65.51 "},{"v":144.24,"d":"144.24 "},{"v":122.61,"d":"122.61 "},{"v":108.18,"d":"108.18 "},{"v":122.61,"d":"122.61 "}]
["Gabón",{"v":59.5,"d":"59.50 "},{"v":52.89,"d":"52.89 "},{"v":49.28,"d":"49.28 "},{"v":52.89,"d":"52.89 "},{"v":117.8,"d":"117.80 "},{"v":100.37,"d":"100.37 "},{"v":88.35,"d":"88.35 "},{"v":100.37,"d":"100.37 "}]
["Ghana",{"v":42.67,"d":"42.67 "},{"v":37.26,"d":"37.26 "},{"v":34.26,"d":"34.26 "},{"v":37.26,"d":"37.26 "},{"v":78.13,"d":"78.13 "},{"v":66.71,"d":"66.71 "},{"v":58.9,"d":"58.90 "},{"v":66.71,"d":"66.71 "}]
["Grecia",{"v":45.08,"d":"45.08 "},{"v":39.07,"d":"39.07 "},{"v":36.66,"d":"36.66 "},{"v":39.07,"d":"39.07 "},{"v":81.14,"d":"81.14 "},{"v":69.12,"d":"69.12 "},{"v":61.3,"d":"61.30 "},{"v":69.12,"d":"69.12 "}]
{"$rows_left_out":61}
{"sheet":"Personal","index":5,"n_rows":702,"n_cols":3,"rows_kept":702,"hidden":true}
["NIF","Nombre y Apellidos","Grupo"]
["16537203L","ACEDO RAMÍREZ, Mª. MONTSERRAT","3"]
["16544145S","ACEDO RAMÍREZ, MIGUEL ANGEL","2"]
["51322616W","ACEÑA PANDO, PEDRO","3"]
["00399280T","ADARVE ALCÁZAR, MARÍA JOSEFA","3"]
["51616377F","AGUDO RUIZ, ALFONSO","2"]
["72875664A","AGUILERA SASTRE, JUAN","2"]
["16218783B","AGUIRRE ORAÁ, JOSÉ MARÍA","2"]
["16489192D","AJAMIL BURGOS, VICTORINA","3"]
["13155868Y","ALBA ELÍAS, FERNANDO","2"]
["16506383L","ALBA IRURZUN, JOSÉ ANTONIO","2"]
["14510970V","ALBAIZAR BUISÁN, Mª TERESA","2"]
["23608191W","ALCÁNTARA IGLESIAS, FELIPE","2"]
["16537637Q","ALDEA MARTÍNEZ, Mª DEL CARMEN","3"]
["16555200F","ALEJOS ORTEGA, MARÍA LUZ","3"]
["16530084F","ALONSO CASTROVIEJO, JESÚS JAVIER","2"]
["13710134H","ALONSO GARCÍA, MARÍA JULIA","2"]
["16563044P","ALONSO IBERGALLARTU, FÉLIX ÁNGEL","2"]
["16560467F","ALONSO MOLINA, CRISTINA","3"]
["16547615N","ALONSO SÁENZ, Mª MONTSERRAT","3"]
["13103464L","ÁLVAREZ BORGE, IGNACIO","2"]
["72778836M","ÁLVAREZ GURREA, JUAN CARLOS","2"]
["25441032L","ÁLVAREZ RUIZ, JESÚS MARÍA","3"]
["16521187B","ÁLVARO ROJO, Mª CONCEPCIÓN","2"]
["16563731M","ANDOLLO SANTAMARÍA, IGNACIO","3"]
["31618249B","ANDRADES RODRÍGUEZ, MARÍA SOLEDAD","2"]
["15238057M","ANDRÉS ASENSIO, MANUEL","3"]
["30565350Y","ANDRÉS GÓMEZ, MARÍA ISABEL","2"]
["16594138Y","ANDRÉS GÓMEZ, MIRIAN","2"]
["16034317M","ANERO MURGA, ÁNGEL","2"]
["29153905W","ANGUIANO RAMOS, MARÍA TERESA","3"]
["16494940F","ANGULO SÁNCHEZ-PRIETO, CARMEN","2"]
["29146573F","ANSORENA BARASOAIN, JOSÉ LUIS","2"]
["16516900W","ANTOÑANZAS VILLAR, FERNANDO","2"]
["16577042E","APELLÁNIZ ESPIGA, MARÍA DEL PILAR","3"]
["16547393C","APELLÁNIZ GÓMEZ, MARÍA TERESA","2"]
["33415737A","ARAGÓN FERNÁNDEZ, CRISTINA","2"]
["16590764J","ARANSAY AZOFRA, JESÚS MARÍA","2"]
["16550671D","ARANSAY GIMÉNEZ, CARLOS JAVIER","3"]
["16511923Q","ARAÚZ GÓMEZ-CADIÑANOS, PEDRO","2"]
{"$rows_left_out":663}
{"sheet":"Municipios","index":6,"n_rows":223,"n_cols":3,"rows_kept":223,"hidden":true}
["Municipio","Descripcion","Provincia"]
["26089","Logroño","La Rioja"]
["26001","Ábalos","La Rioja"]
["26002","Agoncillo","La Rioja"]
["26003","Aguilar del Río Alhama","La Rioja"]
["26004","Ajamil","La Rioja"]
[null,"Albacete","Albacete"]
["26005","Albelda de Iregua","La Rioja"]
["26006","Alberite","La Rioja"]
["26007","Alcanadre","La Rioja"]
["26008","Aldeanueva de Ebro","La Rioja"]
["26009","Alesanco","La Rioja"]
["26010","Alesón","La Rioja"]
["26011","Alfaro","La Rioja"]
[null,"Alicante/Alacant","Alicante/Alacant"]
["26012","Almarza de Cameros","La Rioja"]
[null,"Almería","Almería"]
["26013","Anguciana","La Rioja"]
["26014","Anguiano","La Rioja"]
["26015","Arenzana de Abajo","La Rioja"]
["26016","Arenzana de Arriba","La Rioja"]
["26017","Arnedillo","La Rioja"]
["26018","Arnedo","La Rioja"]
["26019","Arrúbal","La Rioja"]
["26020","Ausejo","La Rioja"]
["26021","Autol","La Rioja"]
[null,"Ávila","Ávila"]
["26022","Azofra","La Rioja"]
[null,"Badajoz","Badajoz"]
["26023","Badarán","La Rioja"]
["26024","Bañares","La Rioja"]
["26026","Baños de Río Tobía","La Rioja"]
["26025","Baños de Rioja","La Rioja"]
[null,"Barcelona","Barcelona"]
["26027","Berceo","La Rioja"]
["26028","Bergasa","La Rioja"]
["26029","Bergasillas Bajera","La Rioja"]
["26030","Bezares","La Rioja"]
[null,"Bilbao","Bilbao"]
["26031","Bobadilla","La Rioja"]
{"$rows_left_out":184}
{"sheet":"Distancias","index":7,"n_rows":2513,"n_cols":5,"rows_kept":2513,"hidden":true}
["Desde","Hasta","Recorrido","Kilometros","check"]
["Ábalos","Logroño",{"$f":"CONCATENATE(A2,\"-hasta-\",B2)","v":"Ábalos-hasta-Logroño"},30,{"$f":"VLOOKUP(A2,Municipios!$B$2:$B$223,1,FALSE)","v":"Ábalos"}]
["Agoncillo","Logroño","Agoncillo-hasta-Logroño",14,{"$f":"VLOOKUP(A3,Municipios!$B$2:$B$223,1,FALSE)","v":"Agoncillo"}]
["Aguilar del Río Alhama","Logroño","Aguilar del Río Alhama-hasta-Logroño",93,{"$f":"VLOOKUP(A4,Municipios!$B$2:$B$223,1,FALSE)","v":"Aguilar del Río Alhama"}]
["Ajamil","Logroño","Ajamil-hasta-Logroño",46,{"$f":"VLOOKUP(A5,Municipios!$B$2:$B$223,1,FALSE)","v":"Ajamil"}]
["Albelda de Iregua","Logroño","Albelda de Iregua-hasta-Logroño",14,{"$f":"VLOOKUP(A6,Municipios!$B$2:$B$223,1,FALSE)","v":"Albelda de Iregua"}]
["Alberite","Logroño","Alberite-hasta-Logroño",8,{"$f":"VLOOKUP(A7,Municipios!$B$2:$B$223,1,FALSE)","v":"Alberite"}]
["Alcanadre","Logroño","Alcanadre-hasta-Logroño",31,{"$f":"VLOOKUP(A8,Municipios!$B$2:$B$223,1,FALSE)","v":"Alcanadre"}]
["Aldeanueva de Ebro","Logroño","Aldeanueva de Ebro-hasta-Logroño",58,{"$f":"VLOOKUP(A9,Municipios!$B$2:$B$223,1,FALSE)","v":"Aldeanueva de Ebro"}]
["Alesanco","Logroño","Alesanco-hasta-Logroño",36,{"$f":"VLOOKUP(A10,Municipios!$B$2:$B$223,1,FALSE)","v":"Alesanco"}]
["Alesón","Logroño","Alesón-hasta-Logroño",24,{"$f":"VLOOKUP(A11,Municipios!$B$2:$B$223,1,FALSE)","v":"Alesón"}]
["Alfaro","Logroño","Alfaro-hasta-Logroño",71,{"$f":"VLOOKUP(A12,Municipios!$B$2:$B$223,1,FALSE)","v":"Alfaro"}]
["Almarza de Cameros","Logroño","Almarza de Cameros-hasta-Logroño",40,{"$f":"VLOOKUP(A13,Municipios!$B$2:$B$223,1,FALSE)","v":"Almarza de Cameros"}]
["Anguciana","Logroño","Anguciana-hasta-Logroño",47,{"$f":"VLOOKUP(A14,Municipios!$B$2:$B$223,1,FALSE)","v":"Anguciana"}]
["Anguiano","Logroño","Anguiano-hasta-Logroño",44,{"$f":"VLOOKUP(A15,Municipios!$B$2:$B$223,1,FALSE)","v":"Anguiano"}]
["Arenzana de Abajo","Logroño","Arenzana de Abajo-hasta-Logroño",28,{"$f":"VLOOKUP(A16,Municipios!$B$2:$B$223,1,FALSE)","v":"Arenzana de Abajo"}]
["Arenzana de Arriba","Logroño","Arenzana de Arriba-hasta-Logroño",28,{"$f":"VLOOKUP(A17,Municipios!$B$2:$B$223,1,FALSE)","v":"Arenzana de Arriba"}]
["Arnedillo","Logroño","Arnedillo-hasta-Logroño",61,{"$f":"VLOOKUP(A18,Municipios!$B$2:$B$223,1,FALSE)","v":"Arnedillo"}]
["Arnedo","Logroño","Arnedo-hasta-Logroño",49,{"$f":"VLOOKUP(A19,Municipios!$B$2:$B$223,1,FALSE)","v":"Arnedo"}]
["Arrúbal","Logroño","Arrúbal-hasta-Logroño",19,{"$f":"VLOOKUP(A20,Municipios!$B$2:$B$223,1,FALSE)","v":"Arrúbal"}]
["Ausejo","Logroño","Ausejo-hasta-Logroño",29,{"$f":"VLOOKUP(A21,Municipios!$B$2:$B$223,1,FALSE)","v":"Ausejo"}]
["Autol","Logroño","Autol-hasta-Logroño",58,{"$f":"VLOOKUP(A22,Municipios!$B$2:$B$223,1,FALSE)","v":"Autol"}]
["Azofra","Logroño","Azofra-hasta-Logroño",34,{"$f":"VLOOKUP(A23,Municipios!$B$2:$B$223,1,FALSE)","v":"Azofra"}]
["Badarán","Logroño","Badarán-hasta-Logroño",35,{"$f":"VLOOKUP(A24,Municipios!$B$2:$B$223,1,FALSE)","v":"Badarán"}]
["Bañares","Logroño","Bañares-hasta-Logroño",45,{"$f":"VLOOKUP(A25,Municipios!$B$2:$B$223,1,FALSE)","v":"Bañares"}]
["Baños de Río Tobía","Logroño","Baños de Río Tobía-hasta-Logroño",35,{"$f":"VLOOKUP(A26,Municipios!$B$2:$B$223,1,FALSE)","v":"Baños de Río Tobía"}]
["Baños de Rioja","Logroño","Baños de Rioja-hasta-Logroño",51,{"$f":"VLOOKUP(A27,Municipios!$B$2:$B$223,1,FALSE)","v":"Baños de Rioja"}]
["Berceo","Logroño","Berceo-hasta-Logroño",41,{"$f":"VLOOKUP(A28,Municipios!$B$2:$B$223,1,FALSE)","v":"Berceo"}]
["Bergasa","Logroño","Bergasa-hasta-Logroño",45,{"$f":"VLOOKUP(A29,Municipios!$B$2:$B$223,1,FALSE)","v":"Bergasa"}]
["Bergasillas Bajera","Logroño","Bergasillas Bajera-hasta-Logroño",48,{"$f":"VLOOKUP(A30,Municipios!$B$2:$B$223,1,FALSE)","v":"Bergasillas Bajera"}]
["Bezares","Logroño","Bezares-hasta-Logroño",32,{"$f":"VLOOKUP(A31,Municipios!$B$2:$B$223,1,FALSE)","v":"Bezares"}]
["Bobadilla","Logroño","Bobadilla-hasta-Logroño",37,{"$f":"VLOOKUP(A32,Municipios!$B$2:$B$223,1,FALSE)","v":"Bobadilla"}]
["Brieva de Cameros","Logroño","Brieva de Cameros-hasta-Logroño",65,{"$f":"VLOOKUP(A33,Municipios!$B$2:$B$223,1,FALSE)","v":"Brieva de Cameros"}]
["Briñas","Logroño","Briñas-hasta-Logroño",46,{"$f":"VLOOKUP(A34,Municipios!$B$2:$B$223,1,FALSE)","v":"Briñas"}]
["Briones","Logroño","Briones-hasta-Logroño",35,{"$f":"VLOOKUP(A35,Municipios!$B$2:$B$223,1,FALSE)","v":"Briones"}]
["Cabezón de Cameros","Logroño","Cabezón de Cameros-hasta-Logroño",43,{"$f":"VLOOKUP(A36,Municipios!$B$2:$B$223,1,FALSE)","v":"Cabezón de Cameros"}]
["Calahorra","Logroño","Calahorra-hasta-Logroño",47,{"$f":"VLOOKUP(A37,Municipios!$B$2:$B$223,1,FALSE)","v":"Calahorra"}]
["Camprovín","Logroño","Camprovín-hasta-Logroño",34,{"$f":"VLOOKUP(A38,Municipios!$B$2:$B$223,1,FALSE)","v":"Camprovín"}]
["Canales de la Sierra","Logroño","Canales de la Sierra-hasta-Logroño",83,{"$f":"VLOOKUP(A39,Municipios!$B$2:$B$223,1,FALSE)","v":"Canales de la Sierra"}]
["Canillas de Río Tuerto","Logroño","Canillas de Río Tuerto-hasta-Logroño",39,{"$f":"VLOOKUP(A40,Municipios!$B$2:$B$223,1,FALSE)","v":"Canillas de Río Tuerto"}]
{"$rows_left_out":2473}