{"text_format":"3","workbook":"xlsx","n_sheets":8,"sheets":["Nacional","Asistencias","Internacional","D.Nacionales","D.Extranjeras","Personal","Municipios","Distancias"],"not_rendered":{"images":2,"defined_names":6,"comments":2},"read":"whole","date_system":"1900"}

{"sheet":"Nacional","index":0,"n_rows":89,"n_cols":13,"rows_kept":89,"merged":[[1,2,6,2],[1,3,2,6],[3,3,4,6],[5,3,6,6],[8,0,8,6],[9,0,9,6],[11,1,11,3],[12,1,12,6],[13,1,13,3],[13,5,13,6],[14,0,14,1],[14,2,14,6],[16,2,16,6],[18,0,19,6],[21,0,21,3],[21,5,25,6],[24,0,24,3],[34,0,34,2],[34,3,34,4],[34,5,34,6],[48,3,49,6],[56,3,56,5],[58,3,59,6],[66,3,67,6],[68,3,73,6],[75,4,75,6],[78,4,78,6],[79,2,80,2],[79,4,79,6],[81,3,82,6],[82,2,83,2],[84,4,84,6],[88,4,88,6]]}
[]
[null,null,"Descripción de la(s) Unidad(es) de Gasto"]
[]
[]
[]
[]
[]
[]
["CUENTA JUSTIFICATIVA PARA LA LIQUIDACIÓN DE COMISIONES DE SERVICIO"]
["Dietas nacionales - Personal Externo"]
[]
["Nombre:",{"$nulls":3},"D.N.I. o Pasaporte:"]
["Domicilio:"]
["Localidad y Código Postal:",{"$nulls":3},"Teléfono:"]
["Código Internacional de Cuenta Bancaria IBAN:"]
[]
["Grupo:",null,{"$f":"IF(OR(B12=\"\",B17=\"\")=TRUE,\"Cumplimente el nombre y el grupo de la persona comisionada\",\"\")","v":"Cumplimente el nombre y el grupo de la persona comisionada"}]
["Descripción de la comisión:"]
[]
[]
[]
["Inicio",{"$nulls":4},{"$f":"IF(B23=\"\",\"Cumplimente la fecha inicio de la comisión\",IF(D23=\"\",\"Cumplimente la hora inicio de la comisión\",IF(B26<B23,IF(B26=\"\",\"Cumplimente la fecha fin de la comisión\",\"Revise la fecha fin de la comisión, ésta no puede ser menor que la de inicio\"),IF(B26=B23,IF(D26<D23,IF(D26=\"\",\"Cumplimente la hora fin de la comisión\",\"Revise la hora fin de la comisión, ésta no puede ser menor que la de inicio\"),\"\"),IF(D26=\"\",\"Cumplimente la hora fin de la comisión\",\"\")))))","v":"Cumplimente la fecha inicio de la comisión"},{"$nulls":3},"Diferencia horas:",{"$f":"IF(AND(D23<>\"\",D26<>\"\",B30=1)=TRUE,D26-D23,\"\")","v":""}]
["Fecha (dd/mm/aa)",null,"Hora (hh:mm):",{"$nulls":6},"Mínimo:","04:59:59"]
[{"$nulls":9},"Inicio","14:00:01"]
["Fin",{"$nulls":3},"Cena",{"$nulls":4},"Duración","04:59:59"]
["Fecha (dd/mm/aa)",null,"Hora (hh:mm):",null,"No",{"$nulls":4},"Dieta 1 Dia:",{"$f":"IF(B30=1,IF(AND(K22>K23,D23<K24,D26>K29)=TRUE,0.5,0),\"\")","v":""}]
[]
["Vehículo particular",null,"Matrícula"]
[{"$nulls":9},"Límite fin","16:00:00"]
["Duración de la comisión:",{"$f":"IF(AND(B23<>\"\",B26<>\"\")=TRUE,B26-B23+1,\"\")","v":""},{"$nulls":7},"Hora inicio:","22:00:00","13:59:59"]
["Dietas máximas:",{"$nulls":8},"Dieta Inicio:",{"$f":"IF(D23>K30,-1,IF(D23>L30,-0.5,0))","v":0}]
["Dietas devengadas:"]
[{"$nulls":9},"Hora fin","22:00:00","14:00:00","13:59:59"]
[]
["Declaración de itinerario (indicar obligatoriamente)",null,null,"Salida",null,"Llegada",{"$nulls":3},"Dieta fin",{"$f":"IF(AND(D26>K33,E26=\"Sí\")=TRUE,0,IF(D26>M33,-0.5,IF(D26<L33,-1)))","v":-1}]
["De:","A:","Kms. (sólo si vehículo particular)","Día","Hora","Día","Hora"]
[null,null,{"$f":"IF($B$28=\"SÍ\",IF(AND(A37<>\"\",B37<>\"\")=TRUE,SUMIF(Distancias!C:C,CONCATENATE(A37,\"-hasta-\",B37),Distancias!D:D),\"\"),\"\")","v":""},{"$nulls":6},"Dieta + 1 Día:",{"$f":"IF(B30>1,B30+K31+K35,\"\")","v":{"$error":"#VALUE!"}}]
[null,null,{"$f":"IF($B$28=\"SÍ\",IF(AND(A38<>\"\",B38<>\"\")=TRUE,SUMIF(Distancias!C:C,CONCATENATE(A38,\"-hasta-\",B38),Distancias!D:D),\"\"),\"\")","v":""}]
[null,null,{"$f":"IF($B$28=\"SÍ\",IF(AND(A39<>\"\",B39<>\"\")=TRUE,SUMIF(Distancias!C:C,CONCATENATE(A39,\"-hasta-\",B39),Distancias!D:D),\"\"),\"\")","v":""}]
[null,null,{"$f":"IF($B$28=\"SÍ\",IF(AND(A40<>\"\",B40<>\"\")=TRUE,SUMIF(Distancias!C:C,CONCATENATE(A40,\"-hasta-\",B40),Distancias!D:D),\"\"),\"\")","v":""}]
[null,null,{"$f":"IF($B$28=\"SÍ\",IF(AND(A41<>\"\",B41<>\"\")=TRUE,SUMIF(Distancias!C:C,CONCATENATE(A41,\"-hasta-\",B41),Distancias!D:D),\"\"),\"\")","v":""}]
[null,null,{"$f":"IF($B$28=\"SÍ\",IF(AND(A42<>\"\",B42<>\"\")=TRUE,SUMIF(Distancias!C:C,CONCATENATE(A42,\"-hasta-\",B42),Distancias!D:D),\"\"),\"\")","v":""}]
[null,null,{"$f":"IF($B$28=\"SÍ\",IF(AND(A43<>\"\",B43<>\"\")=TRUE,SUMIF(Distancias!C:C,CONCATENATE(A43,\"-hasta-\",B43),Distancias!D:D),\"\"),\"\")","v":""}]
[null,null,{"$f":"IF($B$28=\"SÍ\",IF(AND(A44<>\"\",B44<>\"\")=TRUE,SUMIF(Distancias!C:C,CONCATENATE(A44,\"-hasta-\",B44),Distancias!D:D),\"\"),\"\")","v":""}]
[null,"Kilómetros Totales",{"$f":"IF(SUM(C37:C44)>0,SUM(C37:C44),0)","v":0}]
[]
["Gastos manutención","Días","Importe"]
["Dietas máximas:",{"$f":"IF(B30<>\"\",IF(B30=1,K26,K37),\"\")","v":""},{"$f":"IF(B17<>\"\",IF(B30<>\"\",VLOOKUP(B17,D.Nacionales!A:C,3,FALSE)*B48,0),0)","v":0}]
["Dietas devengadas:",{"$f":"B48","v":""},{"$f":"IF(B49<B48,IF(B30<>\"\",VLOOKUP(B17,D.Nacionales!A:C,3,FALSE)*B49,0),C48)","v":0},{"$f":"IF(B49>B48,\"Las dietas devengadas no pueden ser superiores a las máximas\",\"\")","v":""}]
[]
[]
[]
["Gastos de desplazamiento","Importe"]
["Kilometraje",{"$f":"IF(B17<>\"\",IF(C45>0,VLOOKUP(B17,D.Nacionales!A:G,5,FALSE)*C45,0),0)","v":0}]
[]
[]
[{"$nulls":3},"Gastos por Agencia de Viajes"]
[]
[{"$nulls":3},{"$f":"IF(G57=\"\",\"Indicar si existen gastos adicionales a través de alguna Agencia de Viajes\",\"\")","v":"Indicar si existen gastos adicionales a través de alguna Agencia de Viajes"}]
["Total Gastos Locomoción",{"$f":"SUM(B54:B59)","v":0}]
[]
["Gastos de Alojamiento","Importe"]
[]
[null,null,"Máximo por noche"]
[null,null,{"$f":"IF(B30<>\"\",VLOOKUP(B17,D.Nacionales!A:D,4,FALSE),\"\")","v":""}]
[null,null,"Máximo total"]
["Total",{"$f":"SUM(B63:B66)","v":0},{"$f":"IF(B30<>\"\",VLOOKUP(B17,D.Nacionales!A:D,4,FALSE)*(B30-1),\"\")","v":""},{"$f":"IF(B67>C67,\"El gasto de alojamiento no puede ser superior al máximo\",\"\")","v":""}]
[]
["Otros gastos","Importe",null,"   DECLARO ciertos los datos, los  gastos y el itinerario reflejados en la presente cuenta justificativa; así como que los gastos de manutención NO se corresponden con comidas tramitadas de forma paralela (p.ej. incluídas en incripciones o en facturas de gastos protocolarios)"]
[]
[]
[]
[]
[]
["Total Otros Gastos",{"$f":"SUM(B70:B74)","v":0}]
[{"$nulls":3},"   Fecha:  "]
[]
["Liquidación final","Importe"]
["Manutención:",{"$f":"C49","v":0},"Exento IRPF"]
["Locomoción:",{"$f":"B60","v":0},{"$f":"B80-B54+B81+B82","v":0},"   Fdo.:",{"$f":"IF(B12<>\"\",B12,\"\")","v":""}]
["Alojamiento:",{"$f":"IF(B67<C67,B67,C67)","v":0}]
["Otros Gastos:",{"$f":"B75","v":0},"Sujeto IRPF","   CERTIFICO que el interesado ha realizado de conformidad la comisión de servicio de referencia."]
[null,null,{"$f":"B79+B54","v":0}]
["Total Gastos",{"$f":"SUM(B79:B83)","v":0}]
[{"$nulls":3},"   Fecha:  "]
["Anticipo",0,"% Retención"]
["Retención IRPF",{"$f":"ROUNDUP(C87*(B79+B54+B83),2)","v":0},{"v":0.15,"d":"15.00%"}]
["Total a liquidar",{"$f":"B84-B86-B87","v":0}]
[{"$nulls":3},"   Fdo.:"]

{"sheet":"Asistencias","index":1,"n_rows":7,"n_cols":4,"rows_kept":7,"hidden":true}
["Perfil","Categoría","Clave","Importe"]
["Presidente y Secretario","Primera",{"$f":"CONCATENATE(A2,\"-\",B2)","v":"Presidente y Secretario-Primera"},{"v":45.89,"d":"45.89 "}]
["Vocales","Primera","Vocales-Primera",{"v":42.83,"d":"42.83 "}]
["Presidente y Secretario","Segunda","Presidente y Secretario-Segunda",{"v":42.83,"d":"42.83 "}]
["Vocales","Segunda","Vocales-Segunda",{"v":39.78,"d":"39.78 "}]
["Presidente y Secretario","Tercera","Presidente y Secretario-Tercera",{"v":39.78,"d":"39.78 "}]
["Vocales","Tercera","Vocales-Tercera",{"v":36.72,"d":"36.72 "}]

{"sheet":"Internacional","index":2,"n_rows":127,"n_cols":30,"rows_kept":127,"hidden":true,"merged":[[5,0,7,6],[9,1,9,4],[12,0,13,6],[15,1,15,3],[17,0,17,3],[19,0,19,3],[21,0,21,3],[23,0,23,3],[37,0,37,3],[51,0,51,3],[64,3,64,6],[65,3,65,6],[68,0,68,2],[68,3,68,4],[68,5,68,6],[82,2,82,3],[96,0,96,2],[98,3,99,6],[100,3,101,6],[105,3,106,6],[108,4,108,6],[113,4,113,6],[117,3,118,6],[120,4,120,6],[125,4,125,6]]}
[]
[]
[]
[]
[]
["CUENTA JUSTIFICATIVA PARA LA LIQUIDACIÓN DE COMISIONES DE SERVICIO INTERNACIONALES"]
[]
[]
[]
["Nombre:"]
["Grupo:"]
["Descripción de la comisión:"]
[]
[]
[]
["País:"]
[{"$nulls":28},"Inicio Nacional",{"$f":"B21-B19+1+Y29+Y32","v":0}]
["Inicio",{"$nulls":22},"Diferencia horas:",{"$f":"IF(AND(D19<>\"\",D21<>\"\",B27=1)=TRUE,D21-D19,\"\")","v":""}]
["Fecha (dd/mm/aa)",null,"Hora (hh:mm):",{"$nulls":20},"Mínimo:","04:59:59",{"$nulls":3},"Extranjera",{"$f":"B23-B39+1+Y45+Y46","v":0}]
["Salida de España"]
["Fecha (dd/mm/aa)",null,"Hora (hh:mm):"]
["Entrada en España"]
["Fecha (dd/mm/aa)",null,"Hora (hh:mm):",{"$nulls":20},"Inicio","14:00:01"]
["Fin",{"$nulls":3},"Cena",{"$nulls":17},"Cena","Fin","04:59:59",{"$nulls":3},"Fin Nacional",{"$f":"B25-B53+1+Y59+Y61","v":0}]
["Fecha (dd/mm/aa)",null,"Hora (hh:mm):",null,"No",{"$nulls":17},"No","Dieta 1 Dia:",{"$f":"IF(B27=1,IF(AND(Y18>Y19,D19<Y23,D21>Y24)=TRUE,0.5,0),\"\")","v":""}]
[]
["Duración total de la comisión:",{"$f":"IF(AND(B19<>\"\",B25<>\"\")=TRUE,B25-B19+1,\"\")","v":""},{"$nulls":21},"Hora inicio:","22:00:00","13:59:59"]
["Duración de la comisión nacional:",{"$f":"B21-B19+B25-B53","v":0}]
["Dietas máximas:",{"$f":"IF(B27=1,Y25,Y36)","v":{"$error":"#VALUE!"}},{"$nulls":21},"Dieta Inicio Nacional:",{"$f":"IF(D19>Y27,-1,IF(D19>Z27,-0.5,0))","v":0}]
["Dietas devengadas:",1]
["Duración de la comisión inter:",{"$f":"B23-B39+1","v":1},{"$nulls":21},"Hora fin","22:00:00","14:00:00","13:59:59"]
["Dietas máximas inter:",{"$f":"IF(B31=1,Y42,Y49)","v":0},{"$nulls":21},"Dieta fin Nacional",{"$f":"IF(AND(D21>Y31,W25=\"Sí\")=TRUE,0,IF(D21>AA31,-0.5,IF(D21<Z31,-1)))","v":-1}]
["Dietas devengadas inter:",1]
["Alojamiento nacional",{"$f":"B21-B19+B25-B53","v":0}]
["Alojamiento internacional",{"$f":"B23-B21","v":0}]
[{"$nulls":23},"Dieta + 1 Día:",{"$f":"IF(B27>1,B27+Y29+Y32,\"\")","v":{"$error":"#VALUE!"}}]
[]
["Salida de España",{"$nulls":22},"Diferencia horas:",{"$f":"IF(AND(D39<>\"\",D23<>\"\",B31=1)=TRUE,D23-D39,\"\")","v":""}]
["Fecha (dd/mm/aa)",{"$f":"B21","v":"00:00:00"},"Hora (hh:mm):",{"$f":"D21+Y66","v":"00:00:00"},{"$nulls":19},"Mínimo:","04:59:59"]
[{"$nulls":23},"Inicio","14:00:01"]
[{"$nulls":22},"Cena","Fin","04:59:59"]
[{"$nulls":22},"No","Dieta 1 Dia:",{"$f":"IF(B31=1,IF(AND(Y38>Y39,D39<Y40,D23>Y41)=TRUE,0.5,0),\"\")","v":0}]
[]
[{"$nulls":23},"Hora inicio:","22:00:00","13:59:59"]
[{"$nulls":23},"Dieta Inicio Intern:",{"$f":"IF(D39>Y44,-1,IF(D39>Z44,-0.5,0))","v":0}]
[{"$nulls":23},"Dieta fin internac",{"$f":"IF(AND(D23>Y47,W42=\"Sí\")=TRUE,0,IF(D23>AA47,-0.5,IF(D23<Z47,-1)))","v":-1}]
[{"$nulls":23},"Hora fin","22:00:00","14:00:00","13:59:59"]
[]
[{"$nulls":23},"Dieta + 1 Día:",{"$f":"IF(B31>1,B31+Y45+Y46,\"\")","v":""}]
[]
[]
["Entrada en España",{"$nulls":22},"Diferencia horas:",{"$f":"IF(AND(D53<>\"\",D25<>\"\",B58=1)=TRUE,D25-D53,\"\")","v":""}]
["Fecha (dd/mm/aa)",{"$f":"B23","v":"00:00:00"},"Hora (hh:mm):",{"$f":"D23+Y66","v":"00:00:00"},{"$nulls":19},"Mínimo:","04:59:59"]
[{"$nulls":23},"Inicio","14:00:01"]
[{"$nulls":23},"Fin","04:59:59"]
[{"$nulls":23},"Dieta 1 Dia:",{"$f":"IF(B58=1,IF(AND(Y52>Y53,D53<Y54,D25>Y55)=TRUE,0.5,0),\"\")","v":""}]
[]
["Duración de la comisión:",{"$f":"IF(AND(B53<>\"\",B25<>\"\")=TRUE,B25-B53+1,\"\")","v":""},{"$nulls":21},"Hora inicio:","22:00:00","13:59:59"]
["Dietas máximas:",{"$f":"IF(B58=1,Y56,Y63)","v":{"$error":"#VALUE!"}},{"$nulls":21},"Dieta Inicio:",{"$f":"IF(D53>Y58,-1,IF(D53>Z58,-0.5,0))","v":0}]
["Dietas devengadas:",1]
["Dietas máximas:","Días","Importe",{"$nulls":20},"Dieta fin nacional v",{"$f":"IF(AND(D25>Y31,E25=\"Sí\")=TRUE,0,IF(D25>AA31,-0.5,IF(D25<Z31,-1)))","v":-1}]
["Nacionales:",{"$f":"AD17+AD24","v":0},{"$f":"IF(B62>0,VLOOKUP(B11,D.Nacionales!A:C,3,FALSE)*B62,0)","v":0}]
["Internacionales:",{"$f":"AD19","v":0},{"$f":"IF(B63>0,VLOOKUP(B16,D.Extranjeras!A:E,Internacional!B11+1,FALSE)*Internacional!B63,0)","v":0},{"$nulls":20},"Dieta + 1 Día:",{"$f":"IF(B58>1,B58+Y59+Y61,\"\")","v":{"$error":"#VALUE!"}}]
["Dietas devengadas:"]
["Nacionales:",{"$f":"B62","v":0},{"$f":"IF(B65>0,IF(B65>B62,C62,B65*VLOOKUP(B11,D.Nacionales!A:C,3,0)),0)","v":0},{"$f":"IF(B65>B62,\"El importe supera el máximo permitido, se reduce\",\"\")","v":""}]
["Internacionales:",{"$f":"B63","v":0},{"$f":"IF(B66>0,IF(B66>B63,C63,B66*VLOOKUP(B16,D.Extranjeras!A:E,Internacional!B11+1,0)),0)","v":0},{"$f":"IF(B66>B63,\"El importe supera el máximo permitido, se reduce\",\"\")","v":""},{"$nulls":19},"1 segundo","00:00:00"]
[]
[]
["Declaración de itinerario (sólo con vehículo particular)",null,null,"Salida",null,"Llegada",{"$nulls":17},"Dieta fin",{"$f":"IF(AND(D62>Y67,E62=\"Sí\")=TRUE,0,IF(D62>AA67,-0.5,IF(D62<Z67,-1)))","v":false}]
["De:","A:","Kms.","Día","Hora","Día","Hora"]
[null,null,{"$f":"IF(AND(A71<>\"\",B71<>\"\")=TRUE,VLOOKUP(CONCATENATE(A71,\"-hasta-\",B71),Distancias!C:D,2,FALSE),\"\")","v":""},{"$nulls":20},"Dieta + 1 Día:",{"$f":"IF(B64>1,B64+Y65+Y69,\"\")","v":""}]
[null,null,{"$f":"IF(AND(A72<>\"\",B72<>\"\")=TRUE,VLOOKUP(CONCATENATE(A72,\"-hasta-\",B72),Distancias!C:D,2,FALSE),\"\")","v":""}]
[null,null,{"$f":"IF(AND(A73<>\"\",B73<>\"\")=TRUE,VLOOKUP(CONCATENATE(A73,\"-hasta-\",B73),Distancias!C:D,2,FALSE),\"\")","v":""}]
[null,null,{"$f":"IF(AND(A74<>\"\",B74<>\"\")=TRUE,VLOOKUP(CONCATENATE(A74,\"-hasta-\",B74),Distancias!C:D,2,FALSE),\"\")","v":""}]
[null,null,{"$f":"IF(AND(A75<>\"\",B75<>\"\")=TRUE,VLOOKUP(CONCATENATE(A75,\"-hasta-\",B75),Distancias!C:D,2,FALSE),\"\")","v":""}]
[null,null,{"$f":"IF(AND(A76<>\"\",B76<>\"\")=TRUE,VLOOKUP(CONCATENATE(A76,\"-hasta-\",B76),Distancias!C:D,2,FALSE),\"\")","v":""}]
[null,null,{"$f":"IF(AND(A77<>\"\",B77<>\"\")=TRUE,VLOOKUP(CONCATENATE(A77,\"-hasta-\",B77),Distancias!C:D,2,FALSE),\"\")","v":""}]
[null,null,{"$f":"IF(AND(A78<>\"\",B78<>\"\")=TRUE,VLOOKUP(CONCATENATE(A78,\"-hasta-\",B78),Distancias!C:D,2,FALSE),\"\")","v":""}]
[null,null,{"$f":"IF(AND(A79<>\"\",B79<>\"\")=TRUE,VLOOKUP(CONCATENATE(A79,\"-hasta-\",B79),Distancias!C:D,2,FALSE),\"\")","v":""}]
[null,null,{"$f":"IF(AND(A80<>\"\",B80<>\"\")=TRUE,VLOOKUP(CONCATENATE(A80,\"-hasta-\",B80),Distancias!C:D,2,FALSE),\"\")","v":""}]
[null,"Kilómetros Totales",{"$f":"SUM(C71:C80)","v":0}]
[]
[null,null,"IRPF"]
["Gastos de desplazamiento","Importe","Exento","Sujeto"]
["Kilometraje",{"$f":"IF(C81>0,VLOOKUP(B11,D.Nacionales!A:G,5,FALSE)*C81,\"\")","v":""},{"$f":"IF(B85<>\"\",B85-D85,\"\")","v":""},{"$f":"IF(C81>0,VLOOKUP(B11,D.Nacionales!A:G,7,FALSE)*C81,\"\")","v":""}]
{"$rows_empty":9}
["Total Gastos Locomoción",{"$f":"SUM(B85:B94)","v":0}]
[]
["Gastos de Alojamiento"]
["Nacionales","Importe","Máximo"]
[null,null,{"$f":"IF(B34<>0,VLOOKUP(B11,D.Nacionales!A:D,4,0)*(B34),\"\")","v":""},{"$f":"IF(B99>C99,\"El importe supera el máximo permitido, se reduce\",\"\")","v":""}]
["Internacionales","Importe","Máximo"]
[null,null,{"$f":"IF(B35<>0,VLOOKUP(B16,D.Extranjeras!A:I,5+B11)*(B35),0)","v":0},{"$f":"IF(B101>C101,\"El importe supera el máximo permitido, se reduce\",\"\")","v":""}]
["Total",{"$f":"IF(B99>C99,C99,B99)+IF(B101>C101,C101,B101)","v":0}]
[]
["Otros gastos","Importe"]
[]
[{"$nulls":3},"DECLARO ciertos los datos, los  gastos y el itinerario reflejados en la presente cuenta justificativa."]
[]
[]
[{"$nulls":3},"Fecha:  "]
[]
[]
[]
[]
[{"$nulls":3},"Fdo.:"]
["Total Otros Gastos",{"$f":"SUM(B105:B114)","v":0}]
[]
[]
["Liquidación final","Importe",null,"CERTIFICO que el interesado ha realizado de conformidad la comisión de servicio de referencia."]
["Manutención:",{"$f":"C65+C66","v":0}]
["Locomoción:",{"$f":"B95","v":0}]
["Alojamiento:",{"$f":"B102","v":0},null,"Fecha:  "]
["Otros Gastos:",{"$f":"B115","v":0}]
["Total Gastos",{"$f":"SUM(B119:B122)","v":0}]
[]
["Anticipo",0]
[{"$nulls":3},"Fdo.:"]
["Total a liquidar",{"$f":"B123-B125","v":0}]

{"sheet":"D.Nacionales","index":3,"n_rows":5,"n_cols":7,"rows_kept":5,"hidden":true}
["Grupo","Descripción","Manutencion","Alojamiento","Kilometraje","Kilom. Exento","Kilom. IRPF"]
["1","Rector, Vicerrectores, Sec. Gral., Gerente, Vicegerentes, Adjuntos al Rector, Decanos de Facultad o Directores de Escuela y Directores de Departamento",{"v":53.34,"d":"53.34 "},{"v":102.56,"d":"102.56 "},0.22,0.19,0.03]
["2","PDI y PAS de la UR pertenecientes a los cuerpos o escalas clasificados en los grupos A y B, así como personal laboral clasificados en los grupos I y II, y personal de otras administraciones públicas asimilados a los anteriores",{"v":37.4,"d":"37.40 "},{"v":65.97,"d":"65.97 "},0.22,0.19,0.03]
["3","PAS de la UR pertenecientes a los cuerpos o escalas clasificados en los grupos C, D y E, así como al p.laboral de adm.y serv. pertenecientes a los grupos III, IVA y IVB, y personal de otras administraciones públicas asimilados a los anteriores",{"v":28.21,"d":"28.21 "},{"v":48.92,"d":"48.92 "},0.22,0.19,0.03]
["4","Otro personal",{"v":37.4,"d":"37.40 "},{"v":65.97,"d":"65.97 "},0.22,0.19,0.03]

{"sheet":"D.Extranjeras","index":4,"n_rows":100,"n_cols":9,"rows_kept":100,"hidden":true,"merged":[[0,1,0,4],[0,5,0,8]]}
[null,"Manutención",{"$nulls":3},"Alojamiento"]
["País","1","2","3","4","1","2","3","4"]
["Alemania",{"v":68.52,"d":"68.52 "},{"v":59.5,"d":"59.50 "},{"v":55.5,"d":"55.50 "},{"$f":"C3","v":{"v":59.5,"d":"59.50 "}},{"v":155.66,"d":"155.66 "},{"v":132.82,"d":"132.82 "},{"v":117.2,"d":"117.20 "},{"$f":"G3","v":{"v":132.82,"d":"132.82 "}}]
["Andorra",{"v":44.47,"d":"44.47 "},{"v":37.86,"d":"37.86 "},{"v":34.86,"d":"34.86 "},{"$f":"C4","v":{"v":37.86,"d":"37.86 "}},{"v":54.69,"d":"54.69 "},{"v":46.88,"d":"46.88 "},{"v":41.47,"d":"41.47 "},{"$f":"G4","v":{"v":46.88,"d":"46.88 "}}]
["Angola",{"v":66.71,"d":"66.71 "},{"v":59.5,"d":"59.50 "},{"v":55.89,"d":"55.89 "},{"v":59.5,"d":"59.50 "},{"v":158.67,"d":"158.67 "},{"v":135.23,"d":"135.23 "},{"v":119,"d":"119.00 "},{"v":135.23,"d":"135.23 "}]
["Arabia Saudita",{"v":60.7,"d":"60.70 "},{"v":54.09,"d":"54.09 "},{"v":50.49,"d":"50.49 "},{"v":54.09,"d":"54.09 "},{"v":86.55,"d":"86.55 "},{"v":73.92,"d":"73.92 "},{"v":64.91,"d":"64.91 "},{"v":73.92,"d":"73.92 "}]
["Argelia",{"v":51.09,"d":"51.09 "},{"v":44.47,"d":"44.47 "},{"v":42.07,"d":"42.07 "},{"v":44.47,"d":"44.47 "},{"v":119,"d":"119.00 "},{"v":101.57,"d":"101.57 "},{"v":89.55,"d":"89.55 "},{"v":101.57,"d":"101.57 "}]
["Argentina",{"v":64.91,"d":"64.91 "},{"v":55.29,"d":"55.29 "},{"v":50.49,"d":"50.49 "},{"v":55.29,"d":"55.29 "},{"v":130.42,"d":"130.42 "},{"v":111.19,"d":"111.19 "},{"v":97.96,"d":"97.96 "},{"v":111.19,"d":"111.19 "}]
["Australia",{"v":57.1,"d":"57.10 "},{"v":51.09,"d":"51.09 "},{"v":48.08,"d":"48.08 "},{"v":51.09,"d":"51.09 "},{"v":94.96,"d":"94.96 "},{"v":81.14,"d":"81.14 "},{"v":71.52,"d":"71.52 "},{"v":81.14,"d":"81.14 "}]
["Austria",{"v":66.11,"d":"66.11 "},{"v":58.9,"d":"58.90 "},{"v":55.29,"d":"55.29 "},{"v":58.9,"d":"58.90 "},{"v":112.39,"d":"112.39 "},{"v":95.56,"d":"95.56 "},{"v":84.74,"d":"84.74 "},{"v":95.56,"d":"95.56 "}]
["Bélgica",{"v":91.35,"d":"91.35 "},{"v":82.94,"d":"82.94 "},{"v":78.73,"d":"78.73 "},{"v":82.94,"d":"82.94 "},{"v":174.29,"d":"174.29 "},{"v":148.45,"d":"148.45 "},{"v":131.02,"d":"131.02 "},{"v":148.45,"d":"148.45 "}]
["Bolivia",{"v":42.67,"d":"42.67 "},{"v":36.66,"d":"36.66 "},{"v":33.66,"d":"33.66 "},{"v":36.66,"d":"36.66 "},{"v":60.1,"d":"60.10 "},{"v":51.09,"d":"51.09 "},{"v":45.08,"d":"45.08 "},{"v":51.09,"d":"51.09 "}]
["Bosnia-Herzegovina",{"v":57.7,"d":"57.70 "},{"v":49.88,"d":"49.88 "},{"v":45.68,"d":"45.68 "},{"v":49.88,"d":"49.88 "},{"v":85.34,"d":"85.34 "},{"v":72.72,"d":"72.72 "},{"v":64.31,"d":"64.31 "},{"v":72.72,"d":"72.72 "}]
["Brasil",{"v":91.35,"d":"91.35 "},{"v":79.33,"d":"79.33 "},{"v":74.53,"d":"74.53 "},{"v":79.33,"d":"79.33 "},{"v":150.25,"d":"150.25 "},{"v":128.02,"d":"128.02 "},{"v":112.99,"d":"112.99 "},{"v":128.02,"d":"128.02 "}]
["Bulgaria",{"v":44.47,"d":"44.47 "},{"v":37.86,"d":"37.86 "},{"v":35.46,"d":"35.46 "},{"v":37.86,"d":"37.86 "},{"v":62.51,"d":"62.51 "},{"v":53.49,"d":"53.49 "},{"v":46.88,"d":"46.88 "},{"v":53.49,"d":"53.49 "}]
["Camerún",{"v":55.29,"d":"55.29 "},{"v":48.68,"d":"48.68 "},{"v":45.68,"d":"45.68 "},{"v":48.68,"d":"48.68 "},{"v":103.37,"d":"103.37 "},{"v":88.35,"d":"88.35 "},{"v":77.53,"d":"77.53 "},{"v":88.35,"d":"88.35 "}]
["Canadá",{"v":58.3,"d":"58.30 "},{"v":51.69,"d":"51.69 "},{"v":48.68,"d":"48.68 "},{"v":51.69,"d":"51.69 "},{"v":110.59,"d":"110.59 "},{"v":94.36,"d":"94.36 "},{"v":82.94,"d":"82.94 "},{"v":94.36,"d":"94.36 "}]
["Chile",{"v":57.7,"d":"57.70 "},{"v":50.49,"d":"50.49 "},{"v":46.88,"d":"46.88 "},{"v":50.49,"d":"50.49 "},{"v":120.2,"d":"120.20 "},{"v":102.17,"d":"102.17 "},{"v":90.15,"d":"90.15 "},{"v":102.17,"d":"102.17 "}]
["China",{"v":51.69,"d":"51.69 "},{"v":46.28,"d":"46.28 "},{"v":43.27,"d":"43.27 "},{"v":46.28,"d":"46.28 "},{"v":84.14,"d":"84.14 "},{"v":71.52,"d":"71.52 "},{"v":63.11,"d":"63.11 "},{"v":71.52,"d":"71.52 "}]
["Colombia",{"v":90.15,"d":"90.15 "},{"v":78.13,"d":"78.13 "},{"v":73.32,"d":"73.32 "},{"v":78.13,"d":"78.13 "},{"v":145.44,"d":"145.44 "},{"v":123.81,"d":"123.81 "},{"v":109.38,"d":"109.38 "},{"v":123.81,"d":"123.81 "}]
["Corea",{"v":62.51,"d":"62.51 "},{"v":55.29,"d":"55.29 "},{"v":52.89,"d":"52.89 "},{"v":55.29,"d":"55.29 "},{"v":120.2,"d":"120.20 "},{"v":102.17,"d":"102.17 "},{"v":90.15,"d":"90.15 "},{"v":102.17,"d":"102.17 "}]
["Costa de Marfil",{"v":55.89,"d":"55.89 "},{"v":49.28,"d":"49.28 "},{"v":46.28,"d":"46.28 "},{"v":49.28,"d":"49.28 "},{"v":72.12,"d":"72.12 "},{"v":61.3,"d":"61.30 "},{"v":54.09,"d":"54.09 "},{"v":61.3,"d":"61.30 "}]
["Costa Rica",{"v":52.29,"d":"52.29 "},{"v":44.47,"d":"44.47 "},{"v":40.87,"d":"40.87 "},{"v":44.47,"d":"44.47 "},{"v":76.93,"d":"76.93 "},{"v":65.51,"d":"65.51 "},{"v":57.7,"d":"57.70 "},{"v":65.51,"d":"65.51 "}]
["Croacia",{"v":57.7,"d":"57.70 "},{"v":49.88,"d":"49.88 "},{"v":45.68,"d":"45.68 "},{"v":49.88,"d":"49.88 "},{"v":85.34,"d":"85.34 "},{"v":72.72,"d":"72.72 "},{"v":64.31,"d":"64.31 "},{"v":72.72,"d":"72.72 "}]
["Cuba",{"v":38.46,"d":"38.46 "},{"v":33.06,"d":"33.06 "},{"v":29.45,"d":"29.45 "},{"v":33.06,"d":"33.06 "},{"v":66.11,"d":"66.11 "},{"v":56.5,"d":"56.50 "},{"v":49.88,"d":"49.88 "},{"v":56.5,"d":"56.50 "}]
["Dinamarca",{"v":72.12,"d":"72.12 "},{"v":64.91,"d":"64.91 "},{"v":62.51,"d":"62.51 "},{"v":64.91,"d":"64.91 "},{"v":144.24,"d":"144.24 "},{"v":122.61,"d":"122.61 "},{"v":108.18,"d":"108.18 "},{"v":122.61,"d":"122.61 "}]
["R. Dominicana",{"v":42.07,"d":"42.07 "},{"v":36.66,"d":"36.66 "},{"v":34.26,"d":"34.26 "},{"v":36.66,"d":"36.66 "},{"v":75.13,"d":"75.13 "},{"v":64.31,"d":"64.31 "},{"v":56.5,"d":"56.50 "},{"v":64.31,"d":"64.31 "}]
["Ecuador",{"v":50.49,"d":"50.49 "},{"v":43.27,"d":"43.27 "},{"v":39.67,"d":"39.67 "},{"v":43.27,"d":"43.27 "},{"v":75.73,"d":"75.73 "},{"v":64.91,"d":"64.91 "},{"v":57.1,"d":"57.10 "},{"v":64.91,"d":"64.91 "}]
["Egipto",{"v":44.47,"d":"44.47 "},{"v":39.07,"d":"39.07 "},{"v":36.66,"d":"36.66 "},{"v":39.07,"d":"39.07 "},{"v":106.98,"d":"106.98 "},{"v":91.35,"d":"91.35 "},{"v":80.54,"d":"80.54 "},{"v":91.35,"d":"91.35 "}]
["El Salvador",{"v":50.49,"d":"50.49 "},{"v":43.27,"d":"43.27 "},{"v":39.67,"d":"39.67 "},{"v":43.27,"d":"43.27 "},{"v":77.53,"d":"77.53 "},{"v":66.11,"d":"66.11 "},{"v":58.3,"d":"58.30 "},{"v":66.11,"d":"66.11 "}]
["Emiratos Árabes Unidos",{"v":63.71,"d":"63.71 "},{"v":56.5,"d":"56.50 "},{"v":52.89,"d":"52.89 "},{"v":56.5,"d":"56.50 "},{"v":119,"d":"119.00 "},{"v":101.57,"d":"101.57 "},{"v":89.55,"d":"89.55 "},{"v":101.57,"d":"101.57 "}]
["Eslovaquia",{"v":49.88,"d":"49.88 "},{"v":43.27,"d":"43.27 "},{"v":40.87,"d":"40.87 "},{"v":43.27,"d":"43.27 "},{"v":88.95,"d":"88.95 "},{"v":75.73,"d":"75.73 "},{"v":66.71,"d":"66.71 "},{"v":75.73,"d":"75.73 "}]
["Estados Unidos",{"v":77.53,"d":"77.53 "},{"v":69.72,"d":"69.72 "},{"v":66.11,"d":"66.11 "},{"v":69.72,"d":"69.72 "},{"v":168.28,"d":"168.28 "},{"v":143.04,"d":"143.04 "},{"v":126.21,"d":"126.21 "},{"v":143.04,"d":"143.04 "}]
["Etiopía",{"v":43.87,"d":"43.87 "},{"v":37.86,"d":"37.86 "},{"v":34.86,"d":"34.86 "},{"v":37.86,"d":"37.86 "},{"v":140.04,"d":"140.04 "},{"v":119.6,"d":"119.60 "},{"v":105.18,"d":"105.18 "},{"v":119.6,"d":"119.60 "}]
["Filipinas",{"v":45.08,"d":"45.08 "},{"v":39.67,"d":"39.67 "},{"v":36.66,"d":"36.66 "},{"v":39.67,"d":"39.67 "},{"v":84.14,"d":"84.14 "},{"v":71.52,"d":"71.52 "},{"v":63.11,"d":"63.11 "},{"v":71.52,"d":"71.52 "}]
["Finlandia",{"v":72.72,"d":"72.72 "},{"v":65.51,"d":"65.51 "},{"v":62.51,"d":"62.51 "},{"v":65.51,"d":"65.51 "},{"v":134.63,"d":"134.63 "},{"v":114.79,"d":"114.79 "},{"v":100.97,"d":"100.97 "},{"v":114.79,"d":"114.79 "}]
["Francia",{"v":72.72,"d":"72.72 "},{"v":65.51,"d":"65.51 "},{"v":61.9,"d":"61.90 "},{"v":65.51,"d":"65.51 "},{"v":144.24,"d":"144.24 "},{"v":122.61,"d":"122.61 "},{"v":108.18,"d":"108.18 "},{"v":122.61,"d":"122.61 "}]
["Gabón",{"v":59.5,"d":"59.50 "},{"v":52.89,"d":"52.89 "},{"v":49.28,"d":"49.28 "},{"v":52.89,"d":"52.89 "},{"v":117.8,"d":"117.80 "},{"v":100.37,"d":"100.37 "},{"v":88.35,"d":"88.35 "},{"v":100.37,"d":"100.37 "}]
["Ghana",{"v":42.67,"d":"42.67 "},{"v":37.26,"d":"37.26 "},{"v":34.26,"d":"34.26 "},{"v":37.26,"d":"37.26 "},{"v":78.13,"d":"78.13 "},{"v":66.71,"d":"66.71 "},{"v":58.9,"d":"58.90 "},{"v":66.71,"d":"66.71 "}]
["Grecia",{"v":45.08,"d":"45.08 "},{"v":39.07,"d":"39.07 "},{"v":36.66,"d":"36.66 "},{"v":39.07,"d":"39.07 "},{"v":81.14,"d":"81.14 "},{"v":69.12,"d":"69.12 "},{"v":61.3,"d":"61.30 "},{"v":69.12,"d":"69.12 "}]
["Guatemala",{"v":49.28,"d":"49.28 "},{"v":42.67,"d":"42.67 "},{"v":39.67,"d":"39.67 "},{"v":42.67,"d":"42.67 "},{"v":105.18,"d":"105.18 "},{"v":89.55,"d":"89.55 "},{"v":79.33,"d":"79.33 "},{"v":89.55,"d":"89.55 "}]
["Guinea Ecuatorial",{"v":56.5,"d":"56.50 "},{"v":50.49,"d":"50.49 "},{"v":47.48,"d":"47.48 "},{"v":50.49,"d":"50.49 "},{"v":102.77,"d":"102.77 "},{"v":87.75,"d":"87.75 "},{"v":77.53,"d":"77.53 "},{"v":87.75,"d":"87.75 "}]
["Haití",{"v":43.87,"d":"43.87 "},{"v":37.86,"d":"37.86 "},{"v":34.26,"d":"34.26 "},{"v":37.86,"d":"37.86 "},{"v":52.89,"d":"52.89 "},{"v":45.08,"d":"45.08 "},{"v":39.67,"d":"39.67 "},{"v":45.08,"d":"45.08 "}]
["Honduras",{"v":49.28,"d":"49.28 "},{"v":42.07,"d":"42.07 "},{"v":38.46,"d":"38.46 "},{"v":42.07,"d":"42.07 "},{"v":81.74,"d":"81.74 "},{"v":69.72,"d":"69.72 "},{"v":61.3,"d":"61.30 "},{"v":69.72,"d":"69.72 "}]
["Hong Kong",{"v":57.7,"d":"57.70 "},{"v":51.69,"d":"51.69 "},{"v":48.68,"d":"48.68 "},{"v":51.69,"d":"51.69 "},{"v":142.44,"d":"142.44 "},{"v":121.4,"d":"121.40 "},{"v":106.98,"d":"106.98 "},{"v":121.4,"d":"121.40 "}]
["Hungría",{"v":52.89,"d":"52.89 "},{"v":46.28,"d":"46.28 "},{"v":42.67,"d":"42.67 "},{"v":46.28,"d":"46.28 "},{"v":135.23,"d":"135.23 "},{"v":115.39,"d":"115.39 "},{"v":101.57,"d":"101.57 "},{"v":115.39,"d":"115.39 "}]
["India",{"v":40.47,"d":"40.47 "},{"v":38.46,"d":"38.46 "},{"v":36.06,"d":"36.06 "},{"v":38.46,"d":"38.46 "},{"v":117.2,"d":"117.20 "},{"v":99.77,"d":"99.77 "},{"v":88.35,"d":"88.35 "},{"v":99.77,"d":"99.77 "}]
["Indonesia",{"v":48.68,"d":"48.68 "},{"v":42.67,"d":"42.67 "},{"v":39.67,"d":"39.67 "},{"v":42.67,"d":"42.67 "},{"v":120.2,"d":"120.20 "},{"v":102.17,"d":"102.17 "},{"v":90.15,"d":"90.15 "},{"v":102.17,"d":"102.17 "}]
["Irak",{"v":44.47,"d":"44.47 "},{"v":39.07,"d":"39.07 "},{"v":36.66,"d":"36.66 "},{"v":39.07,"d":"39.07 "},{"v":77.53,"d":"77.53 "},{"v":66.11,"d":"66.11 "},{"v":58.3,"d":"58.30 "},{"v":66.11,"d":"66.11 "}]
["Irán",{"v":51.69,"d":"51.69 "},{"v":44.47,"d":"44.47 "},{"v":40.87,"d":"40.87 "},{"v":44.47,"d":"44.47 "},{"v":94.36,"d":"94.36 "},{"v":80.54,"d":"80.54 "},{"v":70.92,"d":"70.92 "},{"v":80.54,"d":"80.54 "}]
["Irlanda",{"v":54.09,"d":"54.09 "},{"v":48.08,"d":"48.08 "},{"v":44.47,"d":"44.47 "},{"v":48.08,"d":"48.08 "},{"v":109.38,"d":"109.38 "},{"v":93.16,"d":"93.16 "},{"v":82.34,"d":"82.34 "},{"v":93.16,"d":"93.16 "}]
["Israel",{"v":63.71,"d":"63.71 "},{"v":56.5,"d":"56.50 "},{"v":52.29,"d":"52.29 "},{"v":56.5,"d":"56.50 "},{"v":108.78,"d":"108.78 "},{"v":92.56,"d":"92.56 "},{"v":81.74,"d":"81.74 "},{"v":92.56,"d":"92.56 "}]
["Italia",{"v":69.72,"d":"69.72 "},{"v":63.11,"d":"63.11 "},{"v":59.5,"d":"59.50 "},{"v":63.11,"d":"63.11 "},{"v":153.86,"d":"153.86 "},{"v":131.02,"d":"131.02 "},{"v":115.39,"d":"115.39 "},{"v":131.02,"d":"131.02 "}]
["Jamaica",{"v":51.69,"d":"51.69 "},{"v":46.28,"d":"46.28 "},{"v":43.87,"d":"43.87 "},{"v":46.28,"d":"46.28 "},{"v":90.15,"d":"90.15 "},{"v":76.93,"d":"76.93 "},{"v":67.91,"d":"67.91 "},{"v":76.93,"d":"76.93 "}]
["Japón",{"v":108.18,"d":"108.18 "},{"v":96.76,"d":"96.76 "},{"v":92.56,"d":"92.56 "},{"v":96.76,"d":"96.76 "},{"v":187.52,"d":"187.52 "},{"v":159.87,"d":"159.87 "},{"v":140.64,"d":"140.64 "},{"v":159.87,"d":"159.87 "}]
["Jordania",{"v":48.68,"d":"48.68 "},{"v":42.67,"d":"42.67 "},{"v":39.67,"d":"39.67 "},{"v":42.67,"d":"42.67 "},{"v":109.38,"d":"109.38 "},{"v":93.16,"d":"93.16 "},{"v":82.34,"d":"82.34 "},{"v":93.16,"d":"93.16 "}]
["Kenia",{"v":45.08,"d":"45.08 "},{"v":39.67,"d":"39.67 "},{"v":36.66,"d":"36.66 "},{"v":39.67,"d":"39.67 "},{"v":96.76,"d":"96.76 "},{"v":82.34,"d":"82.34 "},{"v":72.72,"d":"72.72 "},{"v":82.34,"d":"82.34 "}]
["Kuwait",{"v":50.49,"d":"50.49 "},{"v":44.47,"d":"44.47 "},{"v":41.47,"d":"41.47 "},{"v":44.47,"d":"44.47 "},{"v":144.24,"d":"144.24 "},{"v":122.61,"d":"122.61 "},{"v":108.18,"d":"108.18 "},{"v":122.61,"d":"122.61 "}]
["Líbano",{"v":40.87,"d":"40.87 "},{"v":34.86,"d":"34.86 "},{"v":33.06,"d":"33.06 "},{"v":34.86,"d":"34.86 "},{"v":135.23,"d":"135.23 "},{"v":115.39,"d":"115.39 "},{"v":101.57,"d":"101.57 "},{"v":115.39,"d":"115.39 "}]
["Libia",{"v":62.51,"d":"62.51 "},{"v":54.69,"d":"54.69 "},{"v":51.69,"d":"51.69 "},{"v":54.69,"d":"54.69 "},{"v":119.6,"d":"119.60 "},{"v":102.17,"d":"102.17 "},{"v":90.15,"d":"90.15 "},{"v":102.17,"d":"102.17 "}]
["Luxemburgo",{"v":63.11,"d":"63.11 "},{"v":55.89,"d":"55.89 "},{"v":53.49,"d":"53.49 "},{"v":55.89,"d":"55.89 "},{"v":159.27,"d":"159.27 "},{"v":135.83,"d":"135.83 "},{"v":119.6,"d":"119.60 "},{"v":135.83,"d":"135.83 "}]
["Malasia",{"v":39.67,"d":"39.67 "},{"v":34.26,"d":"34.26 "},{"v":31.25,"d":"31.25 "},{"v":34.26,"d":"34.26 "},{"v":108.18,"d":"108.18 "},{"v":91.95,"d":"91.95 "},{"v":81.14,"d":"81.14 "},{"v":91.95,"d":"91.95 "}]
["Malta",{"v":37.26,"d":"37.26 "},{"v":31.85,"d":"31.85 "},{"v":28.25,"d":"28.25 "},{"v":31.85,"d":"31.85 "},{"v":54.09,"d":"54.09 "},{"v":46.28,"d":"46.28 "},{"v":40.87,"d":"40.87 "},{"v":46.28,"d":"46.28 "}]
["Marruecos",{"v":45.68,"d":"45.68 "},{"v":39.67,"d":"39.67 "},{"v":36.06,"d":"36.06 "},{"v":39.67,"d":"39.67 "},{"v":116.6,"d":"116.60 "},{"v":99.17,"d":"99.17 "},{"v":87.75,"d":"87.75 "},{"v":99.17,"d":"99.17 "}]
["Mauritania",{"v":45.08,"d":"45.08 "},{"v":39.07,"d":"39.07 "},{"v":36.06,"d":"36.06 "},{"v":39.07,"d":"39.07 "},{"v":57.7,"d":"57.70 "},{"v":49.28,"d":"49.28 "},{"v":43.27,"d":"43.27 "},{"v":49.28,"d":"49.28 "}]
["Méjico",{"v":49.88,"d":"49.88 "},{"v":43.27,"d":"43.27 "},{"v":39.07,"d":"39.07 "},{"v":43.27,"d":"43.27 "},{"v":96.16,"d":"96.16 "},{"v":81.74,"d":"81.74 "},{"v":72.12,"d":"72.12 "},{"v":81.74,"d":"81.74 "}]
["Mozambique",{"v":48.08,"d":"48.08 "},{"v":42.67,"d":"42.67 "},{"v":40.27,"d":"40.27 "},{"v":42.67,"d":"42.67 "},{"v":78.73,"d":"78.73 "},{"v":67.31,"d":"67.31 "},{"v":59.5,"d":"59.50 "},{"v":67.31,"d":"67.31 "}]
["Nicaragua",{"v":61.9,"d":"61.90 "},{"v":52.89,"d":"52.89 "},{"v":48.08,"d":"48.08 "},{"$f":"C68","v":{"v":52.89,"d":"52.89 "}},{"v":110.59,"d":"110.59 "},{"v":94.36,"d":"94.36 "},{"v":82.94,"d":"82.94 "},{"$f":"G68","v":{"v":94.36,"d":"94.36 "}}]
["Nigeria",{"v":51.69,"d":"51.69 "},{"v":46.88,"d":"46.88 "},{"v":43.87,"d":"43.87 "},{"v":46.88,"d":"46.88 "},{"v":138.23,"d":"138.23 "},{"v":117.8,"d":"117.80 "},{"v":103.98,"d":"103.98 "},{"v":117.8,"d":"117.80 "}]
["Noruega",{"v":87.55,"d":"87.55 "},{"v":80.54,"d":"80.54 "},{"v":76.93,"d":"76.93 "},{"v":80.54,"d":"80.54 "},{"v":156.26,"d":"156.26 "},{"v":132.82,"d":"132.82 "},{"v":117.2,"d":"117.20 "},{"v":132.82,"d":"132.82 "}]
["Nueva Zelanda",{"v":46.28,"d":"46.28 "},{"v":40.27,"d":"40.27 "},{"v":37.26,"d":"37.26 "},{"v":40.27,"d":"40.27 "},{"v":76.93,"d":"76.93 "},{"v":65.51,"d":"65.51 "},{"v":57.7,"d":"57.70 "},{"v":65.51,"d":"65.51 "}]
["Países Bajos",{"v":71.52,"d":"71.52 "},{"v":64.31,"d":"64.31 "},{"v":61.9,"d":"61.90 "},{"v":64.31,"d":"64.31 "},{"v":149.05,"d":"149.05 "},{"v":126.81,"d":"126.81 "},{"v":111.79,"d":"111.79 "},{"v":126.81,"d":"126.81 "}]
["Pakistán",{"v":43.27,"d":"43.27 "},{"v":37.26,"d":"37.26 "},{"v":34.86,"d":"34.86 "},{"v":37.26,"d":"37.26 "},{"v":68.52,"d":"68.52 "},{"v":58.3,"d":"58.30 "},{"v":51.69,"d":"51.69 "},{"v":58.3,"d":"58.30 "}]
["Panamá",{"v":42.07,"d":"42.07 "},{"v":36.66,"d":"36.66 "},{"v":33.66,"d":"33.66 "},{"v":36.66,"d":"36.66 "},{"v":75.73,"d":"75.73 "},{"v":64.91,"d":"64.91 "},{"v":57.1,"d":"57.10 "},{"v":64.91,"d":"64.91 "}]
["Paraguay",{"v":38.46,"d":"38.46 "},{"v":33.06,"d":"33.06 "},{"v":30.05,"d":"30.05 "},{"v":33.06,"d":"33.06 "},{"v":53.49,"d":"53.49 "},{"v":45.68,"d":"45.68 "},{"v":40.27,"d":"40.27 "},{"v":45.68,"d":"45.68 "}]
["Perú",{"v":50.49,"d":"50.49 "},{"v":43.27,"d":"43.27 "},{"v":39.07,"d":"39.07 "},{"v":43.27,"d":"43.27 "},{"v":93.76,"d":"93.76 "},{"v":79.93,"d":"79.93 "},{"v":70.32,"d":"70.32 "},{"v":79.93,"d":"79.93 "}]
["Polonia",{"v":48.68,"d":"48.68 "},{"v":42.67,"d":"42.67 "},{"v":39.67,"d":"39.67 "},{"v":42.67,"d":"42.67 "},{"v":117.2,"d":"117.20 "},{"v":99.77,"d":"99.77 "},{"v":88.35,"d":"88.35 "},{"v":99.77,"d":"99.77 "}]
["Portugal",{"v":51.09,"d":"51.09 "},{"v":43.87,"d":"43.87 "},{"v":41.47,"d":"41.47 "},{"v":43.87,"d":"43.87 "},{"v":114.19,"d":"114.19 "},{"v":97.36,"d":"97.36 "},{"v":85.94,"d":"85.94 "},{"v":97.36,"d":"97.36 "}]
["Reino Unido",{"v":91.35,"d":"91.35 "},{"v":82.94,"d":"82.94 "},{"v":79.33,"d":"79.33 "},{"v":82.94,"d":"82.94 "},{"v":183.91,"d":"183.91 "},{"v":156.86,"d":"156.86 "},{"v":138.23,"d":"138.23 "},{"v":156.86,"d":"156.86 "}]
["República Checa",{"v":49.88,"d":"49.88 "},{"v":43.27,"d":"43.27 "},{"v":40.87,"d":"40.87 "},{"v":43.27,"d":"43.27 "},{"v":116,"d":"116.00 "},{"v":101.57,"d":"101.57 "},{"v":89.55,"d":"89.55 "},{"v":101.57,"d":"101.57 "}]
["Rumania",{"v":44.47,"d":"44.47 "},{"v":38.46,"d":"38.46 "},{"v":35.46,"d":"35.46 "},{"v":38.46,"d":"38.46 "},{"v":149.05,"d":"149.05 "},{"v":126.81,"d":"126.81 "},{"v":111.79,"d":"111.79 "},{"v":126.81,"d":"126.81 "}]
["Rusia",{"v":83.54,"d":"83.54 "},{"v":73.32,"d":"73.32 "},{"v":68.52,"d":"68.52 "},{"v":73.32,"d":"73.32 "},{"v":267.45,"d":"267.45 "},{"v":227.78,"d":"227.78 "},{"v":200.74,"d":"200.74 "},{"v":227.78,"d":"227.78 "}]
["Senegal",{"v":51.09,"d":"51.09 "},{"v":45.08,"d":"45.08 "},{"v":42.07,"d":"42.07 "},{"v":45.08,"d":"45.08 "},{"v":79.33,"d":"79.33 "},{"v":67.91,"d":"67.91 "},{"v":59.5,"d":"59.50 "},{"v":67.91,"d":"67.91 "}]
["Singapur",{"v":54.09,"d":"54.09 "},{"v":48.08,"d":"48.08 "},{"v":45.08,"d":"45.08 "},{"v":48.08,"d":"48.08 "},{"v":99.77,"d":"99.77 "},{"v":85.34,"d":"85.34 "},{"v":75.13,"d":"75.13 "},{"v":85.34,"d":"85.34 "}]
["Siria",{"v":52.29,"d":"52.29 "},{"v":46.28,"d":"46.28 "},{"v":43.87,"d":"43.87 "},{"v":46.28,"d":"46.28 "},{"v":97.96,"d":"97.96 "},{"v":83.5,"d":"83.50 "},{"v":73.92,"d":"73.92 "},{"v":83.5,"d":"83.50 "}]
["Sudáfrica",{"v":55.89,"d":"55.89 "},{"v":48.08,"d":"48.08 "},{"v":43.87,"d":"43.87 "},{"v":48.08,"d":"48.08 "},{"v":75.13,"d":"75.13 "},{"v":64.31,"d":"64.31 "},{"v":56.5,"d":"56.50 "},{"v":64.31,"d":"64.31 "}]
["Suecia",{"v":82.34,"d":"82.34 "},{"v":75.13,"d":"75.13 "},{"v":69.72,"d":"69.72 "},{"v":75.13,"d":"75.13 "},{"v":173.09,"d":"173.09 "},{"v":147.25,"d":"147.25 "},{"v":129.82,"d":"129.82 "},{"v":147.25,"d":"147.25 "}]
["Suiza",{"v":69.12,"d":"69.12 "},{"v":61.3,"d":"61.30 "},{"v":57.7,"d":"57.70 "},{"v":61.3,"d":"61.30 "},{"v":174.29,"d":"174.29 "},{"v":148.45,"d":"148.45 "},{"v":131.02,"d":"131.02 "},{"v":148.45,"d":"148.45 "}]
["Tailandia",{"v":45.08,"d":"45.08 "},{"v":39.07,"d":"39.07 "},{"v":36.66,"d":"36.66 "},{"v":39.07,"d":"39.07 "},{"v":81.14,"d":"81.14 "},{"v":69.12,"d":"69.12 "},{"v":61.3,"d":"61.30 "},{"v":69.12,"d":"69.12 "}]
["Taiwán",{"v":54.09,"d":"54.09 "},{"v":48.68,"d":"48.68 "},{"v":45.68,"d":"45.68 "},{"v":48.68,"d":"48.68 "},{"v":96.16,"d":"96.16 "},{"v":81.74,"d":"81.74 "},{"v":72.12,"d":"72.12 "},{"v":81.74,"d":"81.74 "}]
["Tanzania",{"v":34.86,"d":"34.86 "},{"v":30.05,"d":"30.05 "},{"v":26.44,"d":"26.44 "},{"v":30.05,"d":"30.05 "},{"v":90.15,"d":"90.15 "},{"v":76.93,"d":"76.93 "},{"v":67.91,"d":"67.91 "},{"v":76.93,"d":"76.93 "}]
["Túnez",{"v":54.09,"d":"54.09 "},{"v":46.28,"d":"46.28 "},{"v":42.07,"d":"42.07 "},{"v":46.28,"d":"46.28 "},{"v":60.7,"d":"60.70 "},{"v":51.69,"d":"51.69 "},{"v":45.68,"d":"45.68 "},{"v":51.69,"d":"51.69 "}]
["Turquía",{"v":45.08,"d":"45.08 "},{"v":39.07,"d":"39.07 "},{"v":36.06,"d":"36.06 "},{"v":39.07,"d":"39.07 "},{"v":72.12,"d":"72.12 "},{"v":61.3,"d":"61.30 "},{"v":54.09,"d":"54.09 "},{"v":61.3,"d":"61.30 "}]
["Uruguay",{"v":48.68,"d":"48.68 "},{"v":41.47,"d":"41.47 "},{"v":37.86,"d":"37.86 "},{"v":41.47,"d":"41.47 "},{"v":67.31,"d":"67.31 "},{"v":57.7,"d":"57.70 "},{"v":50.49,"d":"50.49 "},{"v":57.7,"d":"57.70 "}]
["Venezuela",{"v":42.07,"d":"42.07 "},{"v":36.06,"d":"36.06 "},{"v":33.66,"d":"33.66 "},{"v":36.06,"d":"36.06 "},{"v":91.35,"d":"91.35 "},{"v":78.13,"d":"78.13 "},{"v":68.52,"d":"68.52 "},{"v":78.13,"d":"78.13 "}]
["Yemen",{"v":49.28,"d":"49.28 "},{"v":43.27,"d":"43.27 "},{"v":40.27,"d":"40.27 "},{"v":43.27,"d":"43.27 "},{"v":156.26,"d":"156.26 "},{"v":132.82,"d":"132.82 "},{"v":117.2,"d":"117.20 "},{"v":132.82,"d":"132.82 "}]
["Yugoslavia",{"v":57.68,"d":"57.68 "},{"v":49.88,"d":"49.88 "},{"v":45.68,"d":"45.68 "},{"v":49.88,"d":"49.88 "},{"v":115.39,"d":"115.39 "},{"v":98.57,"d":"98.57 "},{"v":86.55,"d":"86.55 "},{"v":98.57,"d":"98.57 "}]
["Zaire/Congo",{"v":60.7,"d":"60.70 "},{"v":54.09,"d":"54.09 "},{"v":51.69,"d":"51.69 "},{"v":54.09,"d":"54.09 "},{"v":119,"d":"119.00 "},{"v":101.57,"d":"101.57 "},{"v":89.55,"d":"89.55 "},{"v":101.57,"d":"101.57 "}]
["Zimbawe",{"v":45.08,"d":"45.08 "},{"v":39.07,"d":"39.07 "},{"v":36.06,"d":"36.06 "},{"v":39.07,"d":"39.07 "},{"v":90.15,"d":"90.15 "},{"v":76.93,"d":"76.93 "},{"v":67.91,"d":"67.91 "},{"v":76.93,"d":"76.93 "}]
["Resto del mundo",{"v":46.88,"d":"46.88 "},{"v":40.87,"d":"40.87 "},{"v":37.26,"d":"37.26 "},{"v":40.87,"d":"40.87 "},{"v":127.41,"d":"127.41 "},{"v":108.78,"d":"108.78 "},{"v":95.56,"d":"95.56 "},{"v":108.78,"d":"108.78 "}]

{"sheet":"Personal","index":5,"n_rows":702,"n_cols":3,"rows_kept":702,"hidden":true}
["NIF","Nombre y Apellidos","Grupo"]
["16537203L","ACEDO RAMÍREZ, Mª. MONTSERRAT","3"]
["16544145S","ACEDO RAMÍREZ, MIGUEL ANGEL","2"]
["51322616W","ACEÑA PANDO, PEDRO","3"]
["00399280T","ADARVE ALCÁZAR, MARÍA JOSEFA","3"]
["51616377F","AGUDO RUIZ, ALFONSO","2"]
["72875664A","AGUILERA SASTRE, JUAN","2"]
["16218783B","AGUIRRE ORAÁ, JOSÉ MARÍA","2"]
["16489192D","AJAMIL BURGOS, VICTORINA","3"]
["13155868Y","ALBA ELÍAS, FERNANDO","2"]
["16506383L","ALBA IRURZUN, JOSÉ ANTONIO","2"]
["14510970V","ALBAIZAR BUISÁN, Mª TERESA","2"]
["23608191W","ALCÁNTARA IGLESIAS, FELIPE","2"]
["16537637Q","ALDEA MARTÍNEZ, Mª DEL CARMEN","3"]
["16555200F","ALEJOS ORTEGA, MARÍA LUZ","3"]
["16530084F","ALONSO CASTROVIEJO, JESÚS JAVIER","2"]
["13710134H","ALONSO GARCÍA, MARÍA JULIA","2"]
["16563044P","ALONSO IBERGALLARTU, FÉLIX ÁNGEL","2"]
["16560467F","ALONSO MOLINA, CRISTINA","3"]
["16547615N","ALONSO SÁENZ, Mª MONTSERRAT","3"]
["13103464L","ÁLVAREZ BORGE, IGNACIO","2"]
["72778836M","ÁLVAREZ GURREA, JUAN CARLOS","2"]
["25441032L","ÁLVAREZ RUIZ, JESÚS MARÍA","3"]
["16521187B","ÁLVARO ROJO, Mª CONCEPCIÓN","2"]
["16563731M","ANDOLLO SANTAMARÍA, IGNACIO","3"]
["31618249B","ANDRADES RODRÍGUEZ, MARÍA SOLEDAD","2"]
["15238057M","ANDRÉS ASENSIO, MANUEL","3"]
["30565350Y","ANDRÉS GÓMEZ, MARÍA ISABEL","2"]
["16594138Y","ANDRÉS GÓMEZ, MIRIAN","2"]
["16034317M","ANERO MURGA, ÁNGEL","2"]
["29153905W","ANGUIANO RAMOS, MARÍA TERESA","3"]
["16494940F","ANGULO SÁNCHEZ-PRIETO, CARMEN","2"]
["29146573F","ANSORENA BARASOAIN, JOSÉ LUIS","2"]
["16516900W","ANTOÑANZAS VILLAR, FERNANDO","2"]
["16577042E","APELLÁNIZ ESPIGA, MARÍA DEL PILAR","3"]
["16547393C","APELLÁNIZ GÓMEZ, MARÍA TERESA","2"]
["33415737A","ARAGÓN FERNÁNDEZ, CRISTINA","2"]
["16590764J","ARANSAY AZOFRA, JESÚS MARÍA","2"]
["16550671D","ARANSAY GIMÉNEZ, CARLOS JAVIER","3"]
["16511923Q","ARAÚZ GÓMEZ-CADIÑANOS, PEDRO","2"]
["72781903J","ARBIZU MILAGRO, MARÍA JULIA","2"]
["16811605P","ARCHE PEÑA, SUSANA","3"]
["16495292Z","ARETIO MUÑOZ, MARÍA OLGA","3"]
["16588445V","ARGÁIZ DÍEZ, CRISTINA","3"]
["16479361E","ARIZNAVARRETA RUIZ, TOMÁS","2"]
["16530610G","ARMAS MARTÍNEZ, Mª ASUNCIÓN","3"]
["44632242Y","ARMENDARIZ BAYO, Mª PILAR","3"]
["16517462N","ARNÁEZ VADILLO, JOSÉ DIMAS","2"]
["17125236B","ARNAL GIL, PETRA MARÍA","2"]
["17826182D","ARRIBAS GORRINDO, MARÍA LUISA","3"]
["16508607N","ARRIETA VILLARREAL, PABLO","2"]
["16502858J","ARRUE UGARTE, Mª BEGOÑA","2"]
["16557120H","ASENSIO ARÓSTEGUI, MARÍA DEL MAR","2"]
["13120437H","ATIENZA LÓPEZ, MARÍA ÁNGELA","2"]
["16518813Y","AUSEJO GALILEA, JOSÉ","3"]
["16517620D","AVENOZA AZNAR, ALBERTO","2"]
["16530052K","AYALA CALVO, JUAN CARLOS","2"]
["16509321J","AYALA ZURBANO, FERNANDO","2"]
["15841424J","AYESTARÁN ITURBE, Mª BELEN","2"]
["16544280N","AZCONA CIRIZA, ESPERANZA","2"]
["16491822V","AZOFRA CASTROVIEJO, JOSÉ FERNANDO","2"]
["16523160Y","AZOFRA RUEDA, JUAN CARLOS","2"]
["16561259V","AZÓN RAMOS, JORGE","2"]
["16514960V","AZPEITIA BLANCO, Mª. HORTENSIA","3"]
["16534464V","BACHILLER MARTÍNEZ, Mª. ÁNGELES","3"]
["16525052N","BALMASEDA MAESTU, ENRIQUE","2"]
["16524700M","BAÑOS ARRIBAS, IRENE","2"]
["16551006E","BAÑUELOS PÉREZ, YOLANDA","2"]
["16034782X","BAO ITURBE, CARMEN","2"]
["18196196E","BARBER CÁRCAMO, Mª RONCESVALLES","2"]
["16515085G","BARCO ROYO, EMILIO","2"]
["16546617A","BARRERAS GÓMEZ, MARÍA ASUNCIÓN","2"]
["16517745L","BARRIO DÍEZ, JUAN JOSÉ","2"]
["28464592E","BARRIO SANCHA, ROSA MARÍA","3"]
["16547825S","BARRIO SARRAMIÁN, ESTEFANÍA","3"]
["16566979X","BARRIOBERO MARTÍNEZ, IGNACIO","2"]
["16550141P","BARRIUSO RENEDO, SANTOS","3"]
["16439662K","BARTOLOMÉ RAMÍREZ, RICARDO","2"]
["16547497D","BASTIDA SAN RODRIGO, ELOY","3"]
["16547498X","BASTIDA SAN RODRIGO, JUSTINA","3"]
["16617591E","BELLO HERNÁNDEZ, MANUEL","2"]
["13303505Y","BENAVIDES FERNÁNDEZ, NORBERTO","2"]
["16530288G","BENITO CLAVIJO, MARÍA DEL PILAR","2"]
["16546910C","BERENGUER MARÍN, JESÚS RUBÉN","2"]
["16575950B","BERGASA BALDA, EDUARDO","2"]
["16507407P","BERMEJO PÉREZ, DIEGO","2"]
["16556951X","BERRUECO PUELLES, Mª INMACULADA","2"]
["16224938W","BERZAL OTERO, JUAN LUIS","2"]
["16557336G","BLANCO BARRERO, JUAN MANUEL","2"]
["16519644D","BLANCO DAROCA, MARÍA PILAR","3"]
["16545499N","BLANCO ELIZONDO, MARÍA ELENA","3"]
["16520726X","BLANCO EZQUERRO, JOSÉ","2"]
["11967560Q","BLANCO FERNÁNDEZ, BEGOÑA","3"]
["16542535S","BLANCO FERNÁNDEZ, JULIO","2"]
["16567067Y","BLANCO MARTÍNEZ, ANA","3"]
["18033042F","BLANCO PASCUAL, LUIS","2"]
["16465086F","BLANCO SANTA, ELISA","2"]
["21626956X","BLANQUER MARSET, DANIEL LUIS","2"]
["16532770W","BLASCO TOMÁS, YOLANDA","2"]
["X1783741E","BOMBI ., ANDREA","2"]
["14549249R","BONACHÍA CABALLERO, MARÍA JOSEFA","2"]
["16506076B","BORQUE JIMENO, BEATRIZ","3"]
["33518450K","BRAVO MENÉNDEZ-RIVAS, GUILLERMO","2"]
["13059875S","BRAVO VEGA, JULIAN TOMÁS","2"]
["16541690K","BRETÓN RODRÍGUEZ, JAVIER","2"]
["16538447K","BUJANDA ALBIZUA, Mª. DEL PILAR","3"]
["16539381N","BUJANDA REQUIBATIZ, JESÚS","2"]
["16577228R","CABALLERO GONZÁLEZ, LAURA","2"]
["73152016X","CABALLERO LÓPEZ, JOSÉ ANTONIO","2"]
["16529988A","CABALLERO WANGUEMERT, PILAR","3"]
["16544605S","CABREDO PINILLOS, SUSANA","2"]
["16558199Q","CABRERIZO CRISTÓBAL, ADORACIÓN","3"]
["16564883F","CABRERIZO CRISTÓBAL, ELISA","3"]
["16539816X","CABRIA GAN, ISABEL","3"]
["16531843H","CALATRAVA GARCÍA, MARGARITA","3"]
["16556755K","CALAVIA LACARRA, CARLOS PLÁCIDO","3"]
["18402265B","CALVÉ SAN JUAN, ÓSCAR","2"]
["15242069S","CALVILLO SAYAS, JOSÉ LUIS","2"]
["16460319R","CALVO FERNÁNDEZ, MIGUEL","2"]
["12745547M","CAMACHO SÁNCHEZ, MARÍA DEL PILAR","2"]
["16554062L","CÁMARA LAPUENTE, SERGIO","2"]
["16532461S","CÁMARA RUBIO, MARGARITA","3"]
["16516408Q","CÁMARA ZORZANO, Mª JESÚS","2"]
["16597684X","CAMARERO PERAITA, VIRGINIA","3"]
["17836947X","CAMPOS GARCÍA, PEDRO JOSÉ","2"]
["21467595Q","CANO ESQUIBEL, MIGUEL JAIME","2"]
["05218602V","CANTARERO BANDRÉS, ROCÍO","2"]
["16512443F","CASAS ESQUETE, INMACULADA","3"]
["16591412V","CASAS MESAS, Mª DEL CARMEN","3"]
["45077734B","CASCUDO GARCÍA-VILLARACO, TERESA","2"]
["16536532S","CASTILLO PASCUAL, MARÍA JOSEFA","2"]
["16542461X","CASTRESANA RUIZ CARRILLO, JOSÉ IGNACIO","2"]
["16555425W","CELORRIO BARRAGUÉ, LUIS","2"]
["16530276S","CENICEROS SOLDEVILLA, CARMEN","3"]
["16511951K","CENZANO BACHILLER, FCO. JAVIER","3"]
["16559017Y","CERECEDA LLAMAZARES, MARÍA LUISA","3"]
["16506525T","CHÁVARRI MARDONES, MARÍA PEREGRINA","3"]
["17845083G","CHUECA RODRÍGUEZ, RICARDO LUIS","2"]
["16565041G","CIAURRI RAMÍREZ, OSCAR","2"]
["16777282R","CLAVO SEBASTIAN, MARÍA JOSEFINA","2"]
["15839379S","COBO SÁENZ, MARÍA TERESA","2"]
["16539267J","COELLO MARTÍN, CARLOS","2"]
["08960910H","COLLADO MORENO, VICENTA MARTA","3"]
["17852566N","COLOMER BLASCO, LUIS JOSÉ","2"]
["16205986W","CONDE TORRENS, FERNANDO","2"]
["16592485D","CORRAL BOBADILLA, MARINA","2"]
["22728259G","CORTABARRÍA JIMÉNEZ, JESÚS ANDRÉS","2"]
["16562390K","CORZANA SIERRA, ALMUDENA","3"]
["16496299D","CRIADO CRISTÓBAL, Mª MONTSERRAT","3"]
["32661575B","CUBERO SUÁREZ, MARÍA INÉS","3"]
["40310935P","DALMAU TORRES, JOSEP MARÍA","2"]
["16476983J","DELGADO IDARRETA, JOSÉ MIGUEL","2"]
["25460750A","DELGADO SIERRA, VIRGILIO","2"]
["09398535E","DÍAZ CUESTA, JOSÉ","2"]
["16801458G","DÍAZ ENCABO, MARÍA DEL PRADO","3"]
["16520326R","DÍAZ SÁNCHEZ, GERARDA","3"]
["50520695E","DÍAZ YUBERO, FRANCISCO","2"]
["16563028S","DÍEZ CORONADO, MARÍA ÁNGELES","2"]
["16548083C","DIEZ GARCÍA, PORFIRIO","3"]
["00690684V","DIZY SOTO, MARTA Mª INÉS","2"]
["16521843T","DOMENECH SUBIRÁN, JUANA","2"]
["01085841B","DOMÍNGUEZ MATITO, FRANCISCO","2"]
["16489213F","DOMÍNGUEZ MONTAÑA, T. ARACELI","3"]
["16575155K","DOMÍNGUEZ PÉREZ, CÉSAR","2"]
["16501255C","DUEÑAS ÁLVAREZ, PEDRO LUIS","2"]
["16533958V","ECHARRI SÁEZ, ROSA MARÍA","2"]
["16502288H","ECHÁVARRI GRANADO, JOSÉ FEDERICO","2"]
["72775517K","EGÜÉN GARCÍA, ROMÁN","2"]
["16494659W","EGUIZABAL ASCACIBAR, JOSÉ F. JAVIER","2"]
["16591120R","EGUIZÁBAL ELÍAS, LETICIA","3"]
["16539761R","EGUIZABAL HERCE, ANA MARÍA","3"]
["16553320J","ELVIRA IZURRATEGUI, CARLOS","2"]
["16489613Q","ELVIRA MORALES, RAFAEL","2"]
["50822746Z","ENRIQUEZ PALMA, PEDRO ALBERTO","2"]
["16554339C","ESCALONA HERCE, MARÍA JESÚS","2"]
["16548404L","ESCARZA SOMOVILLA, MARÍA CARMEN","3"]
["17189968K","ESCLARÍN MIGUEL, JUAN ÁLVARO","3"]
["18167200Y","ESCOLANO PÉREZ, ELENA","2"]
["16480413Q","ESCORZA SUBERO, FCO.JAVIER","2"]
["17835356Y","ESPAÑOL GONZÁLEZ, LUIS","2"]
["16594879B","ESPIGA ARETIO, IVÁN","3"]
["16468191F","ESPINOSA RUIZ, URBANO","2"]
["16570824Z","ESTEBAN DÍEZ, ISABEL","2"]
["16593589D","ESTEBAN GIL, SUSANA","3"]
["16551816G","ESTEBAN SÁENZ DE JUBERA, ÁNGELA","3"]
["13305907Q","ESTEFANÍA CENDAGORTA, MARÍA","2"]
["30620142N","EXPÓSITO RODRÍGUEZ, JESÚS","3"]
["16511992Q","EXTREMIANA ALDANA, JOSÉ IGNACIO","2"]
["16453923E","EXTREMIANA NAVARRO, PETRA","2"]
["16522528H","EZQUERRA ORTÍN, MARGARITA","2"]
["16549295J","EZQUERRO FERNÁNDEZ, JOSÉ ANTONIO","2"]
["16539601W","FAJARDO SANTA MARÍA, YOLANDA ALICIA","3"]
["17849510S","FANLO LORAS, ANTONIO","2"]
["70865948G","FASLA FERNÁNDEZ, DALILA","2"]
["76611854G","FERNÁNDEZ ARMESTO, MARÍA LUISA","2"]
["16589144A","FERNÁNDEZ FONTECHA, ALMUDENA","2"]
["16508128Q","FERNÁNDEZ GARBAYO, EDUARDO JACINTO","2"]
["16588214Q","FERNÁNDEZ HERCE, ANA MARÍA","3"]
["16523860Q","FERNÁNDEZ HERCE, JORGE","2"]
["16546254P","FERNÁNDEZ HERCE, MARÍA JOSÉ","3"]
["16533382Q","FERNÁNDEZ JIMÉNEZ, LUIS ALFREDO","2"]
["44138279Z","FERNÁNDEZ LAPORTE, HÉCTOR","2"]
["16511900Q","FERNÁNDEZ LARGO, FRANCISCO MANUEL","3"]
["16549841F","FERNÁNDEZ LÓPEZ, JORGE","2"]
["39636069P","FERNÁNDEZ LOSA, NICOLÁS","2"]
["16579957Q","FERNÁNDEZ ORTIZ, RUBÉN","2"]
["16563723C","FERNÁNDEZ RECIO, MIGUEL ÁNGEL","3"]
["16576049H","FERNÁNDEZ SÁENZ DE PIPAÓN, ALICIA","2"]
["16557309T","FERNÁNDEZ TORROBA, MIGUEL ÁNGEL","2"]
["16033362Q","FERNÁNDEZ VILLAMANDOS, ARTURO","2"]
["10877825K","FERNÁNDEZ ZAPICO, MÓNICA","3"]
["16267404X","FERNÁNDEZ ZURBANO, MARÍA PURIFIC.","2"]
["34964416T","FERREÑO COPO, ISABEL","3"]
["17199289G","FILLAT BALLESTEROS, JUAN CARLOS","2"]
["16583327M","FLORES MORENO, CRISTINA","2"]
["73243966Y","FLORES RODRIGO, SUSANA","2"]
["78072932F","FORNÉS GUARDIA, MERCEDES","2"]
["16561901S","FRAILE GARCÍA, ESTEBAN","2"]
["16523985A","GALILEA RODRÍGUEZ, JOSÉ ANTONIO","3"]
["16525570R","GALLARTA GONZÁLEZ, FÉLIX","2"]
["32762940S","GÁNDARA EIROA, JOSÉ CRISANTO","2"]
["16561109M","GARCÉS ECHÁNIZ, ENCARNACIÓN","3"]
["16595315X","GARCÍA ANDREVA, FERNANDO","2"]
["16501875L","GARCÍA ARDANAZ, MARÍA GISELDA","3"]
["16501876C","GARCÍA ARDANAZ, ROSA MARÍA","3"]
["16541665L","GARCÍA BLANCO, JESÚS PLÁCIDO","2"]
["13097830C","GARCÍA CUBILLO, BERNARDO","2"]
["16584724E","GARCÍA DAVALILLO, JAVIER","3"]
["16521592W","GARCÍA EGUIZABAL, ENRIQUE","2"]
["16475047D","GARCÍA GARCÍA, MANUEL","2"]
["16562066L","GARCÍA GARRIDO, EDUARDO","2"]
["16484936P","GARCÍA GÓMEZ, ROSARIO","2"]
["16560400D","GARCÍA GUERRA, Mª DE LOS ÁNGELES","3"]
["25177843L","GARCÍA IBÁÑEZ, ELSA","2"]
["16551912P","GARCÍA IZQUIERDO, FRANCISCO JOSÉ","2"]
["72781079V","GARCÍA MARTÍNEZ, MARÍA CARMEN","3"]
["16545175X","GARCÍA NAVAJAS, MARIA LOURDES","3"]
["16566875K","GARCÍA NEILA, LUIS ANDRÉS","3"]
["16566016J","GARCÍA ORTE, MARÍA BELINDA","3"]
["72779838H","GARCÍA PASCUAL, Mª DEL CARMEN","3"]
["16483216J","GARCÍA SANTA MARÍA, Mª TERESA VICT.","2"]
["16466601G","GARCÍA TURZA, CLAUDIO","2"]
["16513079E","GARCÍA TURZA, FCO.JAVIER","2"]
["16019533X","GARCIANDÍA GONZÁLEZ, PEDRO MARÍA","2"]
["25147795D","GARGALLO IBORT, MARÍA ESTHER","2"]
["16564765G","GARRIDO NÁJERA, ERNESTO","2"]
["50842132B","GAVELA GARCÍA, DELIA","2"]
["06205575Z","GAVIRA TOMÁS, IGNACIO MIGUEL","2"]
["34095882S","GERMÁN ZURRIARÁIN, ROBERTO","2"]
["16532560E","GIL ALBARELLOS ESPERT, ANA","3"]
["13142250G","GIL MARTÍNEZ, MONTSERRAT","2"]
["72787199L","GIL ZAPATA, MARTA","3"]
["16501828H","GIRÓ MIRANDA, JOAQUÍN","2"]
["25145809R","GODED HERRERO, FERNANDO","2"]
["16543068L","GOICOECHEA GAONA, MARÍA ÁNGELES","2"]
["16553136J","GÓMEZ CHOMÓN, JOSÉ CARLOS","2"]
["16564276K","GÓMEZ CRISTOBAL, JOSÉ ANTONIO","2"]
["16564371R","GÓMEZ GARRIDO, JAVIER","2"]
["16564773N","GÓMEZ RODRÍGUEZ, ANA MARÍA","3"]
["05675300G","GÓMEZ RUBIO, GEMA","2"]
["16519521R","GÓMEZ RUBIO, MERCEDES","3"]
["16499934X","GÓMEZ URDÁÑEZ, JOSÉ LUIS","2"]
["16491423D","GONZÁLEZ BACHILLER, FABIÁN","2"]
["16512623A","GONZÁLEZ DE GARAY FERNÁNDEZ, MARÍA TERESA","2"]
["09740221C","GONZÁLEZ FANDOS, MARÍA ELENA","2"]
["16582551B","GONZÁLEZ GIL, JORGE PABLO","3"]
["13031815S","GONZÁLEZ GONZÁLEZ, FCO. JAVIER","2"]
["31228810P","GONZÁLEZ JIMÉNEZ, LUIS","2"]
["16521707W","GONZÁLEZ MENORCA, MARÍA LEONOR","2"]
["13092044F","GONZÁLEZ SÁIZ, JOSÉ MARÍA","2"]
["16566854T","GONZALO PORCEL, DIEGO","2"]
["16517387Y","GRIJALBA SERRAPIO, SAGRARIO","3"]
["16567034L","GUADALUPE MÍNGUEZ, ZENAIDA","2"]
["15333934H","GUALLAR OTAZÚA, FCO. JAVIER","2"]
["13151619N","GUTIERREZ GALERÓN, MYRIAN","2"]
["16546065A","GUTIÉRREZ JIMÉNEZ, JOSÉ MANUEL","2"]
["16528703Y","GUTIÉRREZ VIGUERA, ANA ROSA","2"]
["16536677E","HERCE OYÓN, FERMÍN","2"]
["16539110V","HERNÁEZ LERENA, MARÍA JESÚS","2"]
["72780033Y","HERNÁNDEZ ÁLAMOS, MARÍA DEL MAR","2"]
["42057900P","HERNÁNDEZ MARTÍN, ZENAIDA","2"]
["18408601E","HERNÁNDEZ PARICIO, LUIS JAVIER","2"]
["16520200J","HERNÁNDEZ VERÓN, MIGUEL ANGEL","2"]
["11908773V","HERNANDO ROBLES, ROSA MARÍA","2"]
["16563640Y","HORNOS TORRES, Mª DEL MAR","3"]
["40298595L","HORS GARCÍA, GEMA","2"]
["72779476R","HUERTAS EZQUERRO, Mª CARMEN","2"]
["X4471547W","HUTTER ., MARÍA FLORENCIA","2"]
["16598014H","IBÁÑEZ MORENO, ANA","2"]
["16553440H","IGLESIAS DEL VALLE, FÉLIX FRANCISCO","2"]
["00410009B","IGUACEL CRUZ DE LA, MARÍA DEL PILAR","2"]
["16505956Y","INCHAUSTI ALONSO, TEODORO","2"]
["16535879Y","IÑARREA LAS HERAS, IGNACIO","2"]
["16547976M","IÑARREA LAS HERAS, MANUEL","2"]
["16527742B","IRADIER SANTOS, MARÍA EVA","2"]
["50797038C","IRIARTE VAÑÓ, MARÍA LUISA","2"]
["01778344F","JAIME BARÓ, ÁNGEL LUIS","2"]
["16498683R","JIMÉNEZ CATALÁN, ROSA MARÍA","2"]
["07509173H","JIMÉNEZ FRAILE, MARÍA PAZ","3"]
["72780209K","JIMÉNEZ GALÁN, EDUARDO MIGUEL","2"]
["16508470J","JIMÉNEZ GARRIDO, JESÚS","2"]
["16560638V","JIMÉNEZ GESTAL, CLARA","2"]
["16565868A","JIMÉNEZ MACÍAS, EMILIO","2"]
["16570784C","JIMÉNEZ MARÍN, FRANCISCO JAVIER","2"]
["16496241C","JIMÉNEZ TRENS, MARÍA ASUNCIÓN","2"]
["14605831A","JUAN LA ORDEN, SONIA","3"]
["16594259N","JUANEDA AYENSA, EMMA","2"]
["16517184X","JUÁREZ CASTELLÓ, CARMELO ARTURO","2"]
["16508509Y","JUÁREZ CASTELLÓ, MANUEL CELSO","2"]
["16527554F","JUSTO FUENTES, LUIS CARLOS","3"]
["72777729W","LACOSTE MARÍN, FCO. JAVIER","3"]
["22601632S","LAFARGUE IZQUIERDO, JOSÉ","2"]
["16560196N","LAFUENTE PLAZA, ELOY","3"]
["18009522Q","LALIENA CLEMENTE, JESÚS ANTONIO","2"]
["17140700L","LALINDE PEÑA, ELENA","2"]
["17710488M","LAMBAN PARDO, LAUREANO","2"]
["72699595E","LANCHA URTASUN, MIREN DE UXUA","2"]
["16541342H","LANCHARES BARRASA, VICTOR","2"]
["16566366H","LAPIDO ORTEGA, MARÍA DEL MAR","3"]
["16561261L","LAPRESA AJAMIL, DANIEL","2"]
["13141259W","LARA SANTILLÁN, PEDRO MARÍA","2"]
["16569338T","LASHERAS HERRERO, IGNACIO","2"]
["16532587A","LASHERAS HERRERO, MARÍA PILAR","2"]
["16439862Z","LAUZURICA VALDEMOROS, JOSÉ JAVIER","2"]
["13291079T","LEIVA ANGULO, JOSÉ MIGUEL","2"]
["23602758C","LEMUS VARELA, MARÍA CARMEN DE","2"]
["72777811S","LEÓN MARÍN, JOAQUÍN","2"]
["16522846Z","LERENA RUIZ, MARÍA ISABEL","3"]
["17835463K","LEZA PEÑALBA, MARÍA VEGA","3"]
["16538854Z","LLANOS BARRIOBERO, ESTRELLA","2"]
["15917132M","LOINAZ IRAOLA, MARÍA ICÍAR","3"]
["13284845E","LOMAS ESTEBAN, ANA MARÍA","2"]
["13282264V","LOMAS ESTEBAN, Mª CARMEN","2"]
["51434380D","LÓPEZ ALONSO, MIGUEL","2"]
["72787501E","LÓPEZ AMO, REBECA","3"]
["15830535A","LÓPEZ CALZADA, MARÍA EMILIANA","3"]
["72776549H","LÓPEZ CELORRIO, MILAGROS","3"]
["16547011Y","LÓPEZ DE LUZURIAGA FERNÁNDEZ, JOSÉ MARÍA","2"]
["16569637T","LÓPEZ DE MURILLAS CABRIA, Mª. TERESA","3"]
["16216518T","LÓPEZ DE OCARIZ ALZOLA, JOSÉ JAVIER","2"]
["16509169E","LÓPEZ GONZÁLEZ, LUIS MARÍA","2"]
["72787346M","LÓPEZ OCHOA, LUIS MARÍA","2"]
["14592812W","LORENZO DE REIZÁBAL, MARÍA ARÁNZAZU","2"]
["34092366H","LORENZO TIMÓN, JAIME","2"]
["16509812K","LOZA OLAVE, EDMUNDO","2"]
["16536389X","LOZANO HERCE, R. ROBERTO","2"]
["16558833Y","LOZANO RIVERA, MILLÁN VICENTE","2"]
["25133814N","MAGRIÑÁ CONTRERAS, MARTA","2"]
["72648047V","MANGADO MARTÍNEZ, JOSÉ JAVIER","2"]
["16035217P","MANZANO GARCÍA, GUADALUPE","2"]
["16545036D","MAÑAS DE HUELBES, MANUEL","2"]
["17437495E","MARCO MANCEBÓN, VICENTE SANTIAGO","2"]
["16572677G","MARÍN ABEYTUA, RUBÉN","2"]
["16530377R","MARÍN ANTÓN, Mª DEL ROSARIO","3"]
["13138736D","MARÍN HERNANDO, MARÍA ANGELES","3"]
["26484884Q","MARÍN LÓPEZ, MIGUEL ÁNGEL","2"]
["16802653A","MARÍN VINUESA, LUZ MARÍA","2"]
["16514768D","MARRODÁN ARNEDO, JOSÉ LUIS","3"]
["15229450T","MARRODÁN ESPARZA, FCO.JAVIER","2"]
["16529903X","MARRÓN GÓMEZ, MILAGROS","3"]
["16471179M","MARTIJA CILLERUELO, JAVIER","3"]
["17718016N","MARTÍN ARISTA, FRANCISCO J.","2"]
["02874682G","MARTÍN CASTILLA, RAFAEL","2"]
["16448461B","MARTÍN MARÍN, RICARDO","2"]
["16488751M","MARTÍN OLARTE, JOSÉ FRANCISCO","2"]
["16269475B","MARTÍN Y PÉREZ DE NANCLARES, JOSÉ","2"]
["16532287W","MARTÍNEZ ABAIGAR, JAVIER","2"]
["16512159E","MARTÍNEZ ABANZABALEGUI, MARÍA SOLEDAD","3"]
["44251784Z","MARTÍNEZ BERBEL, JUAN ANTONIO","2"]
["16787895B","MARTÍNEZ BLASCO, ISABEL","2"]
["16579607B","MARTÍNEZ BRAVO, JORGE","3"]
["00815254L","MARTÍNEZ CALVO, MARÍA ÁNGELES","2"]
["16532595B","MARTÍNEZ CENZANO, EDUARDO","3"]
["13298447P","MARTÍNEZ DE PABLO, Mª EUGENIA","2"]
["16538994Q","MARTÍNEZ DE PISÓN ASCACIBAR, EDUARDO","2"]
["16561526P","MARTÍNEZ DE PISÓN ASCACIBAR, FCO.JAVIER","2"]
["17206354P","MARTÍNEZ DE PISÓN CAVERO, JOSÉ MARÍA","2"]
["16589848V","MARTÍNEZ DE SAN VICENTE CUBERO, SERGIO","3"]
["16506579P","MARTÍNEZ DE TODA FERNÁNDEZ, FERNANDO","2"]
["16538269G","MARTÍNEZ ESTEFANÍA, JOSÉ LUIS","2"]
["16535214P","MARTÍNEZ EZQUERRO, AURORA","2"]
["16579574R","MARTÍNEZ FERNÁNDEZ, BEATRIZ","2"]
["16521738X","MARTÍNEZ FERNÁNDEZ, Mª INMACULADA","2"]
["16538692J","MARTÍNEZ GARCÍA, MARÍA ÁNGELES","2"]
["16476520X","MARTÍNEZ LAFUENTE, CARMEN","3"]
["34798214L","MARTÍNEZ LÓPEZ, Mª ISABEL","2"]
["07494181E","MARTÍNEZ LÓPEZ, MIGUEL","2"]
["16545661J","MARTÍNEZ MARTÍNEZ, MARÍA DEL PILAR","3"]
["02856545Z","MARTÍNEZ NAVAS, MARÍA ISABEL","2"]
["16533094G","MARTÍNEZ PÉREZ, ANA BELLA","2"]
["16556347G","MARTÍNEZ RUIZ, MONSERRAT","3"]
["16580433D","MARTÍNEZ RUIZ, RODRIGO","2"]
["16547493M","MARTÍNEZ SÁENZ, Mª ÁNGELES","2"]
["16537707V","MARTÍNEZ SANTOLAYA, JOSÉ JAVIER","2"]
["16518664H","MARTÍNEZ SORIA, MARÍA TERESA","2"]
["16569941M","MARTÍNEZ TOMÁS, Mª PALOMA","2"]
["72779211N","MARTÍNEZ VILLAR, MARÍA ELENA","2"]
["16536550X","MATA SOTÉS, ELOY JAVIER","2"]
["16551819F","MATEO ARANDA, LUCÍA","2"]
["16560658Z","MATEO ARANDA, Mª ISABEL","2"]
["16529361C","MATEO GARCÍA, MARÍA DELIA","3"]
["16478362N","MAYORAL AZOFRA, SALVADOR ÁNGEL","2"]
["16552966G","MAYORAL HERNÁNDEZ, CARLOS","3"]
["72779293W","MAZO CENICEROS, JESÚS MARÍA","3"]
["16565133G","MEDRANO RODRÍGUEZ, JULIA","3"]
["16581660V","MEDRANO SARNAGO, RICARDO","3"]
["28904044J","MEGÍAS ÁLVAREZ, JUAN JOSÉ","2"]
["16590674S","MENDAZA ENRIQUE, IGNACIO","2"]
["16553565M","MENDOZA VILLENA, MONTSERRAT","2"]
["09373135Z","MENÉNDEZ MENÉNDEZ, CRISTINA","2"]
["03454204H","MIGUEL BORREGUERO, MONSERRAT","3"]
["16539508R","MILLÁN MONEO, JUDITH","2"]
["72786536T","MÍNGUEZ CENICEROS, JUDIT","2"]
["17831369K","MÍNGUEZ HERRERO, MARÍA CARMEN","2"]
["16563235S","MIRURI SÁENZ, JUAN MARTÍN","2"]
["24284842Q","MOLINA VALERO, JUAN MANUEL","2"]
["16510187M","MONEO SAENZ, Mª DEL CARMEN","3"]
["16529013V","MONFORTE SERRANO, FRANCISCO JAVIER","2"]
["16531344W","MONTÓN ÁLVAREZ, LUIS ANTONIO","3"]
["16531212P","MONTOYA REPES, Mª ESTHER","3"]
["29100305S","MONTUENGA GÓMEZ, VICTOR MANUEL","2"]
["16524287Y","MORA DÍEZ, ALEJANDRO BERNABÉ","2"]
["16547673R","MORAL MONTES, LUIS","3"]
["16576112N","MORALES ORTIZ, MARÍA DEL PILAR","2"]
["05386149D","MORENO GARCÍA, MARÍA TERESA","2"]
["15343533A","MORENO LARA, MARÍA ANGELES","2"]
["35770205F","MÚGICA OLANO, ALOÑA","2"]
["00687031K","MUNÁRRIZ ALDAZ, JESÚS","2"]
["18866853E","MUÑOZ ARNAU, JUAN ANDRÉS","2"]
["16561905L","MUÑOZ ARNEDO, LUIS ALBERTO","3"]
["16557611A","MUÑOZ MUNILLA, VICTOR JAVIER","2"]
["16575474H","MUÑOZ PINO, ROCIO XIMENA","2"]
["16500778A","MURILLAS ESCUDERO, JUAN MANUEL","2"]
["17122373T","MURILLO RAMÓN, JESÚS","2"]
["16546608V","MURO HERNÁNDEZ, JORGE","2"]
["16519554B","MURO MUNILLA, MIGUEL ANGEL","2"]
["16540393N","NAGORE BARRAL, JESÚS","3"]
["16524869J","NAGORE BARRAL, MARÍA VICTORIA","3"]
["01375419L","NAJARRO GONZÁLEZ, MARÍA DEL PILAR","2"]
["16552123N","NÁJERA HERNÁEZ, MARÍA PILAR","2"]
["16528324H","NAVAJAS ZUBELDÍA, CARLOS","2"]
["72781428K","NAVARIDAS NALDA, FERMÍN","2"]
["16576799D","NAVARIDAS VALLEJO, SUSANA","2"]
["16545437L","NAVARRO ARLEGUI, ANA CARMEN","3"]
["51895357C","NAVARRO ARTEAGA, MARÍA PILAR","3"]
["16543682N","NAVARRO PÉREZ, Mª CRUZ","2"]
["22742410X","NEGUERUELA RUIZ, JULIO","2"]
["16515747E","NIETO GARCÍA, CARLOS","2"]
["73243055S","NOGUÉ PÉREZ, MARÍA TERESA","3"]
["08797523T","NÚÑEZ OLIVERA, ENCARNACIÓN","2"]
["17192512N","NUÑO TORRES, ANA MARÍA","3"]
["16488828J","OCHAGAVÍA FERNÁNDEZ, MARÍA TERESA","3"]
["16513294F","OCÓN MARTÍNEZ, MARÍA ESTHER","3"]
["16531438G","OCÓN NAVARRO, JOSÉ PEDRO","3"]
["72760760F","OJEDA ALBA, MARÍA JULIETA","2"]
["16545261G","OLARTE LARREA, JUAN JOSÉ","2"]
["16543567N","OLARTE MARTÍNEZ, Mª. DEL CARMEN","2"]
["16547433Z","OLARTE PASCUAL, Mª CRISTINA","2"]
["16798088S","OLMOS ARANCÓN, MARÍA TERESA","3"]
["16553823X","OLMOS PÉREZ, MARÍA ELENA","2"]
["10828972C","ORDIERES MERE, JOAQUÍN B.","2"]
["16525412G","ORTIGOSA IZQUIERDO, LUIS MARÍA","2"]
["16555600Q","ORTIGOSA MARTÍNEZ, DAVID","2"]
["17202484W","ORTIZ LALLANA, Mª DEL CARMEN","2"]
["16561168H","OVEJAS ACHA, PILAR ESTHER","3"]
["16489459T","OYÓN BAÑALES, MARÍA LUZ","2"]
["16243789Q","PABLO CONTRERAS, PEDRO V. DE","2"]
["50793513Z","PAEZ DE LA CADENA TORTOSA, FRANCISCO","2"]
["16498983W","PALACIOS ARADILLA, TERESA CONCEPC.","3"]
["07859589Y","PALACIOS GARCÍA, ANTONIO TOMÁS","2"]
["10776530H","PARDO IGLESIAS, ALFONSO","2"]
["16565509N","PARÍS FERNÁNDEZ, MIGUEL","2"]
["16551486L","PASCUAL APARICIO, LUIS JAVIER","3"]
["16548322Y","PASCUAL BELLIDO, NURIA ESTHER","2"]
["16574152F","PASCUAL LERIA, ANA ISABEL","2"]
["16546828F","PASCUAL MARTÍNEZ LOSA, MARÍA VICO","2"]
["16558242J","PASCUAL MEDRANO, MARÍA AMELIA","2"]
["16532195W","PASCUAL SUFRATE, MARÍA TERESA","2"]
["16532588G","PASTOR CLAVIJO, MARÍA CLARA","3"]
["16563058E","PELEGRIN BORONDO, JORGE","2"]
["15863391S","PEÑA NAVARIDAS, JOSÉ MIGUEL","2"]
["02614504W","PERALES VISCASILLAS, MARÍA DEL PILAR","2"]
["16542732M","PEREGRINA GARCÍA, JESÚS MANUEL","2"]
["16570582W","PÉREZ BARRÓN, IVÁN LUIS","2"]
["16578086P","PÉREZ CASTILLO, PALOMA","2"]
["16533076D","PÉREZ CENICEROS, JOSÉ ANTONIO","3"]
["11772392A","PÉREZ CEPEDA, ANA ISABEL","2"]
["16585463W","PÉREZ DE HEREDIA AZCONA, SERGIO","3"]
["28498543W","PÉREZ DE LA PARTE, Mª DE LAS MERCEDES","2"]
["16557014G","PÉREZ GARRIDO, ROSA","2"]
["16568247J","PÉREZ HERNÁNDEZ, MARÍA LORENA","2"]
["16583400D","PÉREZ HERREROS, VICTORIA","2"]
["16559921J","PÉREZ IZAGUIRRE, MARÍA DEL CARMEN","3"]
["29103662Z","PÉREZ IZQUIERDO, JOSÉ MARÍA","2"]
["16598388R","PÉREZ LÁZARO, FRANCISCO JAVIER","2"]
["17110371G","PÉREZ LORENTE, FÉLIX","2"]
["16586100H","PÉREZ MARTÍNEZ, JAVIER","2"]
["72770953B","PÉREZ MERINO, CRUZ","2"]
["72778746F","PÉREZ MORENO, IGNACIO","2"]
["16631140R","PERNÍA ESPINOZA, ALPHA VERÓNICA","2"]
["16554694F","PESO VICENTE, JOSÉ RAMÓN","3"]
["16562098M","PINILLOS GARCÍA, Mª CARMEN","2"]
["16549972T","PINILLOS GARCÍA, MARÍA DE LA O","2"]
["16529310S","PINILLOS MONTALVO, MARINA","3"]
["16514149B","PISERRA BOLAÑOS, MARÍA PILAR","2"]
["13109019P","PIZARRO MILLÁN, CONSUELO","2"]
["15784488W","PLANCHUELO BLASCO, Mª. DEL CARMEN","2"]
["16514966T","PONCE DE LEÓN ELIZONDO, ANA MARÍA","2"]
["16574323V","PORTILLO BARRIO, ARÁNZAZU","2"]
["16533890H","PORTILLO PÉREZ DE VIÑASPRE, FABIOLA","2"]
["16547088Z","POZO RUIZ, FRANCISCO DEL","2"]
["16545062N","PRADAS VELASCO, ROBERTO","2"]
["08966344R","PRADO OSORIO, FELICIANA","2"]
["50301761W","PRADO VILLAR, EDUARDO","2"]
["16477183Y","PRECIADO VIGUERA, JOSE LUIS","3"]
["13288145X","PRESA ABELLA, LUIS JOSÉ","2"]
["14587726E","PUYUELO GARCÍA, MARÍA PILAR","2"]
["16497629M","QUEMADA MAYORAL, MARÍA TERESA","3"]
["16546267K","RAMAS IGEA, Mª LOURDES","3"]
["16514824L","RAMÍREZ CASADO, SANTIAGO","2"]
["16514146P","RAMÍREZ ESQUIBEL, JESÚS MANUEL","2"]
["16500474K","RAMÍREZ MARTÍNEZ, JESÚS","2"]
["17195890D","RAMÍREZ ROSADO, IGNACIO JUAN","2"]
["16600181T","RAMOS ECHAZARRETA, RAFAEL","2"]
["15381719D","RAYA DÍEZ, ESTHER","2"]
["16590935T","RECIO ESCUDERO, JOSÉ ÁNGEL","2"]
["16438138S","REINARES MARTÍNEZ, MARINO","2"]
["16562378D","REPES VALGAÑÓN, JOSÉ JUAN","2"]
["30613903Y","REY AGUILLO, LUIS MIGUEL","2"]
["17721105L","RIAGUAS GUEDÁN, ANA ISABEL","3"]
["72780423M","RIAÑO GIL, CONSUELO","2"]
["44268173G","RÍO CABEZA, AURORA INÉS DEL","2"]
["16539431Q","RÍO SANZ, EMILIO DEL","2"]
["72783806F","RÍOS PUENTE, FERNANDO","2"]
["16495141R","RIPA CORREA, LAURA","3"]
["16510798H","RIVAS RODRÍGUEZ, MARÍA TERESA","2"]
["16591343V","ROBLEDO FERNÁNDEZ  DE TEJADA, REYES","3"]
["16568185C","ROBRES LACALZADA, SARA","3"]
["16565294G","RODRIGO TERROBA, ANA ROSARIO","2"]
["08958579X","RODRÍGUEZ BARRANCO, MIGUEL ANGEL","2"]
["17831792F","RODRÍGUEZ COLLADO, BALBINA","2"]
["11956190P","RODRÍGUEZ FERNÁNDEZ, PABLO LORENZO","2"]
["16504002F","RODRÍGUEZ GONZÁLEZ, CARLOS ALBERTO","2"]
["18209039P","RODRÍGUEZ HIDALGO, JOAQUINA","3"]
["14943754X","RODRÍGUEZ IBEAS, ROBERTO","2"]
["16546928S","RODRÍGUEZ OSÉS, JOSÉ EDUARDO","2"]
["10200766J","ROMÁN FERNÁNDEZ, LUIS RUBÉN","3"]
["16572623L","ROMEO LARREA, LIDIA","3"]
["16573324F","ROMERO ÁLVAREZ, NATALIA","2"]
["16498217H","ROMERO GIL, PEDRO TOMÁS","3"]
["06978557N","RONCERO CARRIZOSA, JOAQUÍN","2"]
["16578034W","ROSA RUIZ-ALEJOS, AMAYA","2"]
["05415214W","ROSÓN ABJEAN, ROBERTO","2"]
["17815557X","ROY LÓBEZ, MIGUEL ANGEL","2"]
["17831339Z","ROYO SARIÑENA, ANTONIO JULIÁN","2"]
["72779052Z","RUBIO BARRAGÁN, NICOLÁS","2"]
["16509284E","RUBIO CRESPO, MARÍA JESÚS","2"]
["73079169G","RUBIO GARCÍA, ÁNGEL LUIS","2"]
["16012006G","RUBIO GARCÍA, JULIO JESÚS","2"]
["16525592T","RUBIO LERENA, MARÍA VICTORIA","2"]
["16550436G","RUBIO MARTÍNEZ, Mª LUZ","2"]
["16569567E","RUIZ BOBADILLA, MARÍA TERESA","3"]
["17159455Y","RUIZ CABESTRE, FCO. JAVIER","2"]
["16556965R","RUIZ CANTABRANA, BEGOÑA","3"]
["25993950V","RUIZ DE ADANA SANTIAGO, MANUEL MARÍA","2"]
["16554562J","RUIZ DE LA CUESTA MONEO, MARGARITA","2"]
["16535060S","RUIZ DE MENDOZA IBÁÑEZ, FRANCISCO JOSÉ","2"]
["16536773A","RUIZ DE PALACIOS VILLAVERDE, JOSÉ IGNACIO","2"]
["16541664H","RUIZ FORNIES, JOSE LUIS","3"]
["29151542P","RUIZ GARCÍA, JOSÉ ESTEBAN","3"]
["14245719W","RUIZ LARREA, MARÍA FERNANDA","2"]
["16535111C","RUIZ SUSO, RAQUEL","3"]
["29146878J","RUIZ TOLA, FCO. JAVIER","3"]
["29138895B","RUIZ TOLA, MARÍA MERCEDES","3"]
["10828501D","RUIZ VEGA, AGUSTÍN V.","2"]
["16803976S","RUIZ VICENTE, JOSÉ JAVIER","3"]
["16574340B","RUIZ-ALEJOS GÓMEZ, CÉSAR","2"]
["16530869X","RUIZ-OLALDE SÁENZ, Mª DEL ROSARIO","3"]
["16545318S","RUIZ-OLALLA CORCUERA, Mª CARMEN","2"]
["16503633Y","RUIZOLALLA PÉREZ, Mª. DEL CARMEN","3"]
["16545002K","SABATER FERNÁNDEZ, Mª CARMEN","2"]
["72786371L","SACRISTÁN TOBÍAS, SARA","2"]
["16559052H","SÁENZ ARGAIZ, ANA ROSA","2"]
["16537076F","SÁENZ BARRIO, CECILIA","2"]
["16503381F","SÁENZ BERCEO, Mª. CARMEN","2"]
["16567689F","SÁENZ DE CABEZÓN IRIGARAY, EDUARDO","2"]
["16555450G","SÁENZ DE SANTA MARÍA CABREDO, EUGENIO","3"]
["16553057A","SÁENZ DIEZ MURO, JUAN CARLOS","2"]
["16585435C","SÁENZ GAITÁN, ANA","3"]
["16561369N","SÁENZ GAITÁN, Mª VICTORIA","3"]
["16538106W","SÁENZ JIMÉNEZ, DIVINA","3"]
["16538681W","SÁENZ LÓPEZ, MARÍA DEL MAR","3"]
["16575777E","SÁENZ LÓPEZ, RAÚL","2"]
["16558179L","SÁENZ URBINA, Mª. ESTRELLA","3"]
["15852371N","SÁEZ MARTÍNEZ, Mª. DEL CARMEN","3"]
["16507414S","SÁINZ OCHOA, ALBERTO","2"]
["25140498A","SALAMERO GARCÍA, ENCARNACIÓN","3"]
["16542973Q","SALAS ILARRAZA, JOSÉ PABLO","2"]
["16581606D","SALAZAR TERREROS, IDANA","2"]
["16551895Z","SALINAS ZÁRATE, RODOLFO","2"]
["17850875T","SALINERO CASCANTE, MARÍA JESÚS J.","2"]
["17817327D","SAN GIL LAPUERTA, MARÍA PILAR","3"]
["16537949Y","SAN JUAN DÍAZ, JUAN FÉLIX","2"]
["13137354F","SAN MARTÍN GARRIDO, ARTURO","3"]
["16485240J","SAN MARTÍN GONZALO, JOSÉ LUIS","3"]
["16538368B","SAN MARTÍN MARQUÉS, JULIÁN JAVIER","2"]
["16542072N","SAN MARTÍN PÉREZ, MONTSERRAT","2"]
["16540725E","SANCHA GONZÁLEZ, JUAN CARLOS","2"]
["13104263J","SÁNCHEZ HERNÁNDEZ, ÁNGEL","2"]
["50452049P","SÁNCHEZ ORTEGA, DAVID","3"]
["16543626W","SÁNCHEZ RODRÍGUEZ, JOSÉ LUIS","3"]
["16529085C","SÁNCHEZ SALAS, BERNARDO","2"]
["16538579S","SÁNCHEZ TORRES, DANIEL","3"]
["16261031P","SANTAMARÍA ARINAS, RENÉ JAVIER","2"]
["16526587Y","SANTAMARÍA PEÑA, JACINTO","2"]
["16520166W","SANTANA MARTÍNEZ, PEDRO","2"]
["16556907N","SANTIBÁÑEZ DE LA CRUZ, AMAYA","3"]
["16449282G","SANTIBÁÑEZ VELILLA, JOSEFINA","2"]
["16560792X","SANTOLAYA ESTEFANÍA, MARÍA DEL PILAR","2"]
["16556364K","SANTOLAYA MARTÍNEZ, MARÍA ESTHER","3"]
["16541208E","SANTOLAYA RUIZ-CLAVIJO, CELESTE","3"]
["13099529V","SANTOS DEL VALLE, LUIS FERNANDO","2"]
["05220234Q","SANTOS VELASCO, JUAN ANTONIO","2"]
["16509086P","SANZ ADÁN, FÉLIX","2"]
["16582228X","SANZ ARAZURI, EVA","2"]
["16462104S","SANZ ASENSIO, JESÚS","2"]
["11728090E","SANZ CERVERA, SUSANA A.","2"]
["01496407G","SANZ MÉNDEZ, TEÓFILO","2"]
["17728530S","SANZ PARICIO, CARLOS","3"]
["39847439P","SASTRE I RIBA, SYLVIA","2"]
["X1448109Y","SCHMITT ., THOMAS LUDWIG","2"]
["16558831G","SEDANO CADIÑANOS, LORENZO A.","2"]
["09295364Y","SERRANO CUADRADO, MARÍA HENAR","3"]
["16563493C","SESMA BASTIDA, BEGOÑA","2"]
["11937115T","SESMA FERNÁNDEZ, GREGORIO","3"]
["13122718E","SIERRA MURILLO, JOSÉ DANIEL","2"]
["13080014Y","SIERRA MURILLO, MARÍA YOLANDA","2"]
["16559166V","SIERRA SOTO, JOSÉ MANUEL","3"]
["16556358S","SILVESTRE SALAS, MARÍA DEL SOL","2"]
["18195329Y","SOLA ROS, MARÍA PILAR","3"]
["35029531W","SOLAESA GONZÁLEZ, Mª. LUISA","3"]
["16012143A","SOLAESA GONZÁLEZ, MARÍA JOSÉ","2"]
["29086924C","SOLANAS MARCÉN, Mª ELENA","3"]
["11916944T","SOLDEVILLA SANZ, MARÍA JAZMINA","3"]
["16562995M","SOMALO SAN JUAN, MARÍA","2"]
["16564358B","SOTA EGUIZABAL, JOSÉ MANUEL","2"]
["16587452J","SOTÉS ACEDO, DIEGO","2"]
["13136610E","SOTO FERNÁNDEZ, FRANCISCO","2"]
["16481554F","SUCUNZA VICENTE, FRANCISCO","2"]
["X1452321D","SULLIVAN ., JAMES ROBERT","2"]
["18027322Z","SUSÍN BETRÁN, RAÚL","2"]
["30422325H","TAPIA LÓPEZ, MARÍA EULALIA","3"]
["72785742B","TARANCÓN ANDRÉS, EFRÉN","2"]
["07852960R","TARDÁGUILA LASO, MANUEL JAVIER","2"]
["16562797Z","TEJADA MARTÍNEZ, JOSÉ JAVIER","2"]
["16268560Q","TEJADA SÁNCHEZ, Mª SORAYA","2"]
["16585702B","TEJADO SEBASTIÁN, JOSÉ MARÍA","2"]
["11727159B","TEJEDOR MARBÁN, ISIDRO","2"]
["16582369J","TÉLLEZ ALARCIA, DIEGO","2"]
["30520840R","TENA VÁZQUEZ DE LA TORRE, MARÍA TERESA","2"]
["16570999M","TERRAZAS GALLEGO, MELANIA","2"]
["16563333K","TERROBA PASCUAL, ISABEL","2"]
["16557121L","TERROBA PASCUAL, MARÍA VALVANERA","2"]
["16531083V","TOMÁS LAS HERAS, RAFAEL","2"]
["16533310J","TORRE RESA, MARÍA JESÚS DE","2"]
["16505576V","TORRECILLA MIGUEL, MILAGROS","2"]
["05625302P","TORRES MANRIQUE, Mª DEL CARMEN","2"]
["16472524Q","TORROBA SANTA MARÍA, MARÍA TERESA","2"]
["16532926C","TREVIÑO FERNÁNDEZ, MARÍA PILAR","2"]
["16554469N","URRACA FERNÁNDEZ, JOSÉ MARÍA","2"]
["42819023S","URRACA MARTÍNEZ, MARÍA LUZ","2"]
["16576351K","URREA CORRES, MARÍA DE LA O","2"]
["16595590D","VALERIO MORENO, BEATRIZ","3"]
["16529127Q","VALLEJO LAVILLA, LUIS","3"]
["16594506Y","VARGAS MONTOYA, PILAR","2"]
["16530493W","VARONA MALUMBRES, JUAN LUIS","2"]
["16531283X","VÁZQUEZ LÓPEZ, CÉSAR","2"]
["09308464L","VEGA GUTIÉRREZ, ANA MARÍA","2"]
["42053327N","VENTURA VENTURA, JOSÉ MANUEL","2"]
["10855902V","VERGARA GONZÁLEZ, ELISEO PABLO","2"]
["16549785C","VICUÑA MARTÍNEZ, JAVIER ESTEBAN","2"]
["16537745D","VILLANUEVA ARREA, ANA","2"]
["16529369M","VILLANUEVA ARREA, MARÍA YOLANDA","3"]
["13748929N","VILLAR FLOR, CARLOS JOSÉ","2"]
["72776832W","VILLARO VILLARO, Mª ELENA","3"]
["16567371B","VILLODAS ORTE, JUAN RAMÓN","2"]
["16527730E","VILLOSLADA VILLOSLADA, GREGORIO","2"]
["16586509J","YANGUAS BEITIA, GLORIA","2"]
["16010137K","YESA CHARELA, IGNACIO","3"]
["16568260A","YUBERO UBEDA, JORGE","2"]
["16537290Z","ZABALZA IZQUIERDO, JESÚS","3"]
["16504840V","ZABALZA IZQUIERDO, MARÍA TERESA","3"]
["16552499C","ZABALZA IZQUIERDO, MARTA","3"]
["25136873N","ZARAZAGA CHAMORRO, MIRIAN","2"]
["16532885W","ZORZANO ALBA, ENRIQUE","2"]
["16549519F","ZORZANO MARTÍNEZ, ANTONIO MOISÉS","2"]
["16513797G","ZORZANO MARTÍNEZ, JOSÉ MARÍA","2"]
["16518274L","ZORZANO MARTÍNEZ, LUIS FRANCISCO","2"]
["16541257W","ZORZANO SANTAMARÍA, PEDRO JOSÉ","2"]
["16558782R","ZUAZO CAMPS, MARÍA GISELA","3"]
["16528510C","ZULUETA GURREA, ISABEL","2"]
["16543785T","ZURBANO ASENSIO, MARÍA DEL MAR","2"]

{"sheet":"Municipios","index":6,"n_rows":223,"n_cols":3,"rows_kept":223,"hidden":true}
["Municipio","Descripcion","Provincia"]
["26089","Logroño","La Rioja"]
["26001","Ábalos","La Rioja"]
["26002","Agoncillo","La Rioja"]
["26003","Aguilar del Río Alhama","La Rioja"]
["26004","Ajamil","La Rioja"]
[null,"Albacete","Albacete"]
["26005","Albelda de Iregua","La Rioja"]
["26006","Alberite","La Rioja"]
["26007","Alcanadre","La Rioja"]
["26008","Aldeanueva de Ebro","La Rioja"]
["26009","Alesanco","La Rioja"]
["26010","Alesón","La Rioja"]
["26011","Alfaro","La Rioja"]
[null,"Alicante/Alacant","Alicante/Alacant"]
["26012","Almarza de Cameros","La Rioja"]
[null,"Almería","Almería"]
["26013","Anguciana","La Rioja"]
["26014","Anguiano","La Rioja"]
["26015","Arenzana de Abajo","La Rioja"]
["26016","Arenzana de Arriba","La Rioja"]
["26017","Arnedillo","La Rioja"]
["26018","Arnedo","La Rioja"]
["26019","Arrúbal","La Rioja"]
["26020","Ausejo","La Rioja"]
["26021","Autol","La Rioja"]
[null,"Ávila","Ávila"]
["26022","Azofra","La Rioja"]
[null,"Badajoz","Badajoz"]
["26023","Badarán","La Rioja"]
["26024","Bañares","La Rioja"]
["26026","Baños de Río Tobía","La Rioja"]
["26025","Baños de Rioja","La Rioja"]
[null,"Barcelona","Barcelona"]
["26027","Berceo","La Rioja"]
["26028","Bergasa","La Rioja"]
["26029","Bergasillas Bajera","La Rioja"]
["26030","Bezares","La Rioja"]
[null,"Bilbao","Bilbao"]
["26031","Bobadilla","La Rioja"]
["26032","Brieva de Cameros","La Rioja"]
["26033","Briñas","La Rioja"]
["26034","Briones","La Rioja"]
[null,"Burgos","Burgos"]
["26035","Cabezón de Cameros","La Rioja"]
[null,"Cáceres","Cáceres"]
[null,"Cádiz","Cádiz"]
["26036","Calahorra","La Rioja"]
["26037","Camprovín","La Rioja"]
["26038","Canales de la Sierra","La Rioja"]
["26039","Canillas de Río Tuerto","La Rioja"]
["26040","Cañas","La Rioja"]
["26041","Cárdenas","La Rioja"]
["26042","Casalarreina","La Rioja"]
["26043","Castañares de Rioja","La Rioja"]
[null,"Castellón de la Plana/Castelló de la Plana","Castellón de la Plana/Castelló de la Plana"]
["26044","Castroviejo","La Rioja"]
["26045","Cellorigo","La Rioja"]
["26046","Cenicero","La Rioja"]
["26047","Cervera del Río Alhama","La Rioja"]
["26048","Cidamón","La Rioja"]
["26049","Cihuri","La Rioja"]
["26050","Cirueña","La Rioja"]
[null,"Ciudad Real","Ciudad Real"]
["26051","Clavijo","La Rioja"]
[null,"Córdoba","Córdoba"]
["26052","Cordovín","La Rioja"]
["26053","Corera","La Rioja"]
["26054","Cornago","La Rioja"]
["26055","Corporales","La Rioja"]
[null,"Coruña (A)","Coruña (A)"]
[null,"Cuenca","Cuenca"]
["26056","Cuzcurrita de Río Tirón","La Rioja"]
["26057","Daroca de Rioja","La Rioja"]
[null,"Donostia-San Sebastián","Donostia-San Sebastián"]
[null,"San Sebastián","San Sebastián"]
["26058","Enciso","La Rioja"]
["26059","Entrena","La Rioja"]
["26060","Estollo","La Rioja"]
["26061","Ezcaray","La Rioja"]
["26062","Foncea","La Rioja"]
["26063","Fonzaleche","La Rioja"]
["26064","Fuenmayor","La Rioja"]
["26065","Galbárruli","La Rioja"]
["26066","Galilea","La Rioja"]
["26067","Gallinero de Cameros","La Rioja"]
["26068","Gimileo","La Rioja"]
[null,"Girona","Girona"]
[null,"Granada","Granada"]
["26069","Grañón","La Rioja"]
["26070","Grávalos","La Rioja"]
[null,"Guadalajara","Guadalajara"]
["26071","Haro","La Rioja"]
["26072","Herce","La Rioja"]
["26073","Herramélluri","La Rioja"]
["26074","Hervías","La Rioja"]
["26075","Hormilla","La Rioja"]
["26076","Hormilleja","La Rioja"]
["26077","Hornillos de Cameros","La Rioja"]
["26078","Hornos de Moncalvillo","La Rioja"]
[null,"Huelva","Huelva"]
["26079","Huércanos","La Rioja"]
[null,"Huesca","Huesca"]
["26080","Igea","La Rioja"]
[null,"Jaén","Jaén"]
["26081","Jalón de Cameros","La Rioja"]
["26082","Laguna de Cameros","La Rioja"]
["26083","Lagunilla del Jubera","La Rioja"]
["26084","Lardero","La Rioja"]
["26086","Ledesma de la Cogolla","La Rioja"]
["26087","Leiva","La Rioja"]
[null,"León","León"]
["26088","Leza de Río Leza","La Rioja"]
[null,"Lleida","Lleida"]
["26089","Logroño","La Rioja"]
[null,"Lugo","Lugo"]
["26091","Lumbreras","La Rioja"]
[null,"Madrid","Madrid"]
[null,"Málaga","Málaga"]
["26092","Manjarrés","La Rioja"]
["26093","Mansilla de la Sierra","La Rioja"]
["26094","Manzanares de Rioja","La Rioja"]
["26095","Matute","La Rioja"]
["26096","Medrano","La Rioja"]
["26098","Munilla","La Rioja"]
[null,"Murcia","Murcia"]
["26099","Murillo de Río Leza","La Rioja"]
["26100","Muro de Aguas","La Rioja"]
["26101","Muro en Cameros","La Rioja"]
["26102","Nájera","La Rioja"]
["26103","Nalda","La Rioja"]
["26104","Navajún","La Rioja"]
["26105","Navarrete","La Rioja"]
["26106","Nestares","La Rioja"]
["26107","Nieva de Cameros","La Rioja"]
["26109","Ochánduri","La Rioja"]
["26108","Ocón","La Rioja"]
["26110","Ojacastro","La Rioja"]
["26111","Ollauri","La Rioja"]
["26112","Ortigosa de Cameros","La Rioja"]
[null,"Ourense","Ourense"]
[null,"Oviedo","Oviedo"]
[null,"Palencia","Palencia"]
[null,"Pamplona/Iruña","Pamplona/Iruña"]
["26113","Pazuengos","La Rioja"]
["26114","Pedroso","La Rioja"]
["26115","Pinillos","La Rioja"]
[null,"Pontevedra","Pontevedra"]
["26117","Pradejón","La Rioja"]
["26118","Pradillo","La Rioja"]
["26119","Préjano","La Rioja"]
["26120","Quel","La Rioja"]
["26121","Rabanera","La Rioja"]
["26122","Rasillo de Cameros (El)","La Rioja"]
["26123","Redal (El)","La Rioja"]
["26124","Ribafrecha","La Rioja"]
["26125","Rincón de Soto","La Rioja"]
["26126","Robres del Castillo","La Rioja"]
["26127","Rodezno","La Rioja"]
["26128","Sajazarra","La Rioja"]
[null,"Salamanca","Salamanca"]
["26129","San Asensio","La Rioja"]
["26130","San Millán de la Cogolla","La Rioja"]
["26131","San Millán de Yécora","La Rioja"]
["26132","San Román de Cameros","La Rioja"]
["26139","San Torcuato","La Rioja"]
["26142","San Vicente de la Sonsierra","La Rioja"]
["26134","Santa Coloma","La Rioja"]
["26135","Santa Engracia del Jubera","La Rioja"]
["26136","Santa Eulalia Bajera","La Rioja"]
[null,"Santander","Santander"]
["26138","Santo Domingo de la Calzada","La Rioja"]
["26140","Santurde de Rioja","La Rioja"]
["26141","Santurdejo","La Rioja"]
[null,"Segovia","Segovia"]
[null,"Sevilla","Sevilla"]
["26143","Sojuela","La Rioja"]
[null,"Soria","Soria"]
["26144","Sorzano","La Rioja"]
["26145","Sotés","La Rioja"]
["26146","Soto en Cameros","La Rioja"]
[null,"Tarragona","Tarragona"]
["26147","Terroba","La Rioja"]
[null,"Teruel","Teruel"]
["26148","Tirgo","La Rioja"]
["26149","Tobía","La Rioja"]
[null,"Toledo","Toledo"]
["26150","Tormantos","La Rioja"]
["26153","Torre en Cameros","La Rioja"]
["26151","Torrecilla en Cameros","La Rioja"]
["26152","Torrecilla sobre Alesanco","La Rioja"]
["26154","Torremontalbo","La Rioja"]
["26155","Treviana","La Rioja"]
["26157","Tricio","La Rioja"]
["26158","Tudelilla","La Rioja"]
["26160","Uruñuela","La Rioja"]
["26161","Valdemadera","La Rioja"]
[null,"Valencia","Valencia"]
["26162","Valgañón","La Rioja"]
[null,"Valladolid","Valladolid"]
["26163","Ventosa","La Rioja"]
["26164","Ventrosa","La Rioja"]
["26165","Viguera","La Rioja"]
["26166","Villalba de Rioja","La Rioja"]
["26167","Villalobar de Rioja","La Rioja"]
["26168","Villamediana de Iregua","La Rioja"]
["26169","Villanueva de Cameros","La Rioja"]
["26170","Villar de Arnedo (El)","La Rioja"]
["26171","Villar de Torre","La Rioja"]
["26172","Villarejo","La Rioja"]
["26173","Villarroya","La Rioja"]
["26174","Villarta-Quintana","La Rioja"]
["26175","Villavelayo","La Rioja"]
["26176","Villaverde de Rioja","La Rioja"]
["26177","Villoslada de Cameros","La Rioja"]
["26178","Viniegra de Abajo","La Rioja"]
["26179","Viniegra de Arriba","La Rioja"]
[null,"Vitoria-Gasteiz","Vitoria-Gasteiz"]
[null,"Zamora","Zamora"]
[null,"Zaragoza","Zaragoza"]
["26180","Zarratón","La Rioja"]
["26181","Zarzosa","La Rioja"]
["26183","Zorraquín","La Rioja"]

{"sheet":"Distancias","index":7,"n_rows":2513,"n_cols":5,"rows_kept":2513,"hidden":true}
["Desde","Hasta","Recorrido","Kilometros","check"]
["Ábalos","Logroño",{"$f":"CONCATENATE(A2,\"-hasta-\",B2)","v":"Ábalos-hasta-Logroño"},30,{"$f":"VLOOKUP(A2,Municipios!$B$2:$B$223,1,FALSE)","v":"Ábalos"}]
["Agoncillo","Logroño","Agoncillo-hasta-Logroño",14,{"$f":"VLOOKUP(A3,Municipios!$B$2:$B$223,1,FALSE)","v":"Agoncillo"}]
["Aguilar del Río Alhama","Logroño","Aguilar del Río Alhama-hasta-Logroño",93,{"$f":"VLOOKUP(A4,Municipios!$B$2:$B$223,1,FALSE)","v":"Aguilar del Río Alhama"}]
["Ajamil","Logroño","Ajamil-hasta-Logroño",46,{"$f":"VLOOKUP(A5,Municipios!$B$2:$B$223,1,FALSE)","v":"Ajamil"}]
["Albelda de Iregua","Logroño","Albelda de Iregua-hasta-Logroño",14,{"$f":"VLOOKUP(A6,Municipios!$B$2:$B$223,1,FALSE)","v":"Albelda de Iregua"}]
["Alberite","Logroño","Alberite-hasta-Logroño",8,{"$f":"VLOOKUP(A7,Municipios!$B$2:$B$223,1,FALSE)","v":"Alberite"}]
["Alcanadre","Logroño","Alcanadre-hasta-Logroño",31,{"$f":"VLOOKUP(A8,Municipios!$B$2:$B$223,1,FALSE)","v":"Alcanadre"}]
["Aldeanueva de Ebro","Logroño","Aldeanueva de Ebro-hasta-Logroño",58,{"$f":"VLOOKUP(A9,Municipios!$B$2:$B$223,1,FALSE)","v":"Aldeanueva de Ebro"}]
["Alesanco","Logroño","Alesanco-hasta-Logroño",36,{"$f":"VLOOKUP(A10,Municipios!$B$2:$B$223,1,FALSE)","v":"Alesanco"}]
["Alesón","Logroño","Alesón-hasta-Logroño",24,{"$f":"VLOOKUP(A11,Municipios!$B$2:$B$223,1,FALSE)","v":"Alesón"}]
["Alfaro","Logroño","Alfaro-hasta-Logroño",71,{"$f":"VLOOKUP(A12,Municipios!$B$2:$B$223,1,FALSE)","v":"Alfaro"}]
["Almarza de Cameros","Logroño","Almarza de Cameros-hasta-Logroño",40,{"$f":"VLOOKUP(A13,Municipios!$B$2:$B$223,1,FALSE)","v":"Almarza de Cameros"}]
["Anguciana","Logroño","Anguciana-hasta-Logroño",47,{"$f":"VLOOKUP(A14,Municipios!$B$2:$B$223,1,FALSE)","v":"Anguciana"}]
["Anguiano","Logroño","Anguiano-hasta-Logroño",44,{"$f":"VLOOKUP(A15,Municipios!$B$2:$B$223,1,FALSE)","v":"Anguiano"}]
["Arenzana de Abajo","Logroño","Arenzana de Abajo-hasta-Logroño",28,{"$f":"VLOOKUP(A16,Municipios!$B$2:$B$223,1,FALSE)","v":"Arenzana de Abajo"}]
["Arenzana de Arriba","Logroño","Arenzana de Arriba-hasta-Logroño",28,{"$f":"VLOOKUP(A17,Municipios!$B$2:$B$223,1,FALSE)","v":"Arenzana de Arriba"}]
["Arnedillo","Logroño","Arnedillo-hasta-Logroño",61,{"$f":"VLOOKUP(A18,Municipios!$B$2:$B$223,1,FALSE)","v":"Arnedillo"}]
["Arnedo","Logroño","Arnedo-hasta-Logroño",49,{"$f":"VLOOKUP(A19,Municipios!$B$2:$B$223,1,FALSE)","v":"Arnedo"}]
["Arrúbal","Logroño","Arrúbal-hasta-Logroño",19,{"$f":"VLOOKUP(A20,Municipios!$B$2:$B$223,1,FALSE)","v":"Arrúbal"}]
["Ausejo","Logroño","Ausejo-hasta-Logroño",29,{"$f":"VLOOKUP(A21,Municipios!$B$2:$B$223,1,FALSE)","v":"Ausejo"}]
["Autol","Logroño","Autol-hasta-Logroño",58,{"$f":"VLOOKUP(A22,Municipios!$B$2:$B$223,1,FALSE)","v":"Autol"}]
["Azofra","Logroño","Azofra-hasta-Logroño",34,{"$f":"VLOOKUP(A23,Municipios!$B$2:$B$223,1,FALSE)","v":"Azofra"}]
["Badarán","Logroño","Badarán-hasta-Logroño",35,{"$f":"VLOOKUP(A24,Municipios!$B$2:$B$223,1,FALSE)","v":"Badarán"}]
["Bañares","Logroño","Bañares-hasta-Logroño",45,{"$f":"VLOOKUP(A25,Municipios!$B$2:$B$223,1,FALSE)","v":"Bañares"}]
["Baños de Río Tobía","Logroño","Baños de Río Tobía-hasta-Logroño",35,{"$f":"VLOOKUP(A26,Municipios!$B$2:$B$223,1,FALSE)","v":"Baños de Río Tobía"}]
["Baños de Rioja","Logroño","Baños de Rioja-hasta-Logroño",51,{"$f":"VLOOKUP(A27,Municipios!$B$2:$B$223,1,FALSE)","v":"Baños de Rioja"}]
["Berceo","Logroño","Berceo-hasta-Logroño",41,{"$f":"VLOOKUP(A28,Municipios!$B$2:$B$223,1,FALSE)","v":"Berceo"}]
["Bergasa","Logroño","Bergasa-hasta-Logroño",45,{"$f":"VLOOKUP(A29,Municipios!$B$2:$B$223,1,FALSE)","v":"Bergasa"}]
["Bergasillas Bajera","Logroño","Bergasillas Bajera-hasta-Logroño",48,{"$f":"VLOOKUP(A30,Municipios!$B$2:$B$223,1,FALSE)","v":"Bergasillas Bajera"}]
["Bezares","Logroño","Bezares-hasta-Logroño",32,{"$f":"VLOOKUP(A31,Municipios!$B$2:$B$223,1,FALSE)","v":"Bezares"}]
["Bobadilla","Logroño","Bobadilla-hasta-Logroño",37,{"$f":"VLOOKUP(A32,Municipios!$B$2:$B$223,1,FALSE)","v":"Bobadilla"}]
["Brieva de Cameros","Logroño","Brieva de Cameros-hasta-Logroño",65,{"$f":"VLOOKUP(A33,Municipios!$B$2:$B$223,1,FALSE)","v":"Brieva de Cameros"}]
["Briñas","Logroño","Briñas-hasta-Logroño",46,{"$f":"VLOOKUP(A34,Municipios!$B$2:$B$223,1,FALSE)","v":"Briñas"}]
["Briones","Logroño","Briones-hasta-Logroño",35,{"$f":"VLOOKUP(A35,Municipios!$B$2:$B$223,1,FALSE)","v":"Briones"}]
["Cabezón de Cameros","Logroño","Cabezón de Cameros-hasta-Logroño",43,{"$f":"VLOOKUP(A36,Municipios!$B$2:$B$223,1,FALSE)","v":"Cabezón de Cameros"}]
["Calahorra","Logroño","Calahorra-hasta-Logroño",47,{"$f":"VLOOKUP(A37,Municipios!$B$2:$B$223,1,FALSE)","v":"Calahorra"}]
["Camprovín","Logroño","Camprovín-hasta-Logroño",34,{"$f":"VLOOKUP(A38,Municipios!$B$2:$B$223,1,FALSE)","v":"Camprovín"}]
["Canales de la Sierra","Logroño","Canales de la Sierra-hasta-Logroño",83,{"$f":"VLOOKUP(A39,Municipios!$B$2:$B$223,1,FALSE)","v":"Canales de la Sierra"}]
["Canillas de Río Tuerto","Logroño","Canillas de Río Tuerto-hasta-Logroño",39,{"$f":"VLOOKUP(A40,Municipios!$B$2:$B$223,1,FALSE)","v":"Canillas de Río Tuerto"}]
["Cañas","Logroño","Cañas-hasta-Logroño",40,{"$f":"VLOOKUP(A41,Municipios!$B$2:$B$223,1,FALSE)","v":"Cañas"}]
["Cárdenas","Logroño","Cárdenas-hasta-Logroño",32,{"$f":"VLOOKUP(A42,Municipios!$B$2:$B$223,1,FALSE)","v":"Cárdenas"}]
["Casalarreina","Logroño","Casalarreina-hasta-Logroño",46,{"$f":"VLOOKUP(A43,Municipios!$B$2:$B$223,1,FALSE)","v":"Casalarreina"}]
["Castañares de Rioja","Logroño","Castañares de Rioja-hasta-Logroño",50,{"$f":"VLOOKUP(A44,Municipios!$B$2:$B$223,1,FALSE)","v":"Castañares de Rioja"}]
["Castroviejo","Logroño","Castroviejo-hasta-Logroño",35,{"$f":"VLOOKUP(A45,Municipios!$B$2:$B$223,1,FALSE)","v":"Castroviejo"}]
["Cellorigo","Logroño","Cellorigo-hasta-Logroño",63,{"$f":"VLOOKUP(A46,Municipios!$B$2:$B$223,1,FALSE)","v":"Cellorigo"}]
["Cenicero","Logroño","Cenicero-hasta-Logroño",21,{"$f":"VLOOKUP(A47,Municipios!$B$2:$B$223,1,FALSE)","v":"Cenicero"}]
["Cervera del Río Alhama","Logroño","Cervera del Río Alhama-hasta-Logroño",86,{"$f":"VLOOKUP(A48,Municipios!$B$2:$B$223,1,FALSE)","v":"Cervera del Río Alhama"}]
["Cidamón","Logroño","Cidamón-hasta-Logroño",48,{"$f":"VLOOKUP(A49,Municipios!$B$2:$B$223,1,FALSE)","v":"Cidamón"}]
["Cihuri","Logroño","Cihuri-hasta-Logroño",48,{"$f":"VLOOKUP(A50,Municipios!$B$2:$B$223,1,FALSE)","v":"Cihuri"}]
["Cirueña","Logroño","Cirueña-hasta-Logroño",44,{"$f":"VLOOKUP(A51,Municipios!$B$2:$B$223,1,FALSE)","v":"Cirueña"}]
["Clavijo","Logroño","Clavijo-hasta-Logroño",17,{"$f":"VLOOKUP(A52,Municipios!$B$2:$B$223,1,FALSE)","v":"Clavijo"}]
["Cordovín","Logroño","Cordovín-hasta-Logroño",38,{"$f":"VLOOKUP(A53,Municipios!$B$2:$B$223,1,FALSE)","v":"Cordovín"}]
["Corera","Logroño","Corera-hasta-Logroño",27,{"$f":"VLOOKUP(A54,Municipios!$B$2:$B$223,1,FALSE)","v":"Corera"}]
["Cornago","Logroño","Cornago-hasta-Logroño",73,{"$f":"VLOOKUP(A55,Municipios!$B$2:$B$223,1,FALSE)","v":"Cornago"}]
["Corporales","Logroño","Corporales-hasta-Logroño",50,{"$f":"VLOOKUP(A56,Municipios!$B$2:$B$223,1,FALSE)","v":"Corporales"}]
["Cuzcurrita de Río Tirón","Logroño","Cuzcurrita de Río Tirón-hasta-Logroño",51,{"$f":"VLOOKUP(A57,Municipios!$B$2:$B$223,1,FALSE)","v":"Cuzcurrita de Río Tirón"}]
["Daroca de Rioja","Logroño","Daroca de Rioja-hasta-Logroño",20,{"$f":"VLOOKUP(A58,Municipios!$B$2:$B$223,1,FALSE)","v":"Daroca de Rioja"}]
["Enciso","Logroño","Enciso-hasta-Logroño",71,{"$f":"VLOOKUP(A59,Municipios!$B$2:$B$223,1,FALSE)","v":"Enciso"}]
["Entrena","Logroño","Entrena-hasta-Logroño",13,{"$f":"VLOOKUP(A60,Municipios!$B$2:$B$223,1,FALSE)","v":"Entrena"}]
["Estollo","Logroño","Estollo-hasta-Logroño",43,{"$f":"VLOOKUP(A61,Municipios!$B$2:$B$223,1,FALSE)","v":"Estollo"}]
["Ezcaray","Logroño","Ezcaray-hasta-Logroño",60,{"$f":"VLOOKUP(A62,Municipios!$B$2:$B$223,1,FALSE)","v":"Ezcaray"}]
["Foncea","Logroño","Foncea-hasta-Logroño",62,{"$f":"VLOOKUP(A63,Municipios!$B$2:$B$223,1,FALSE)","v":"Foncea"}]
["Fonzaleche","Logroño","Fonzaleche-hasta-Logroño",57,{"$f":"VLOOKUP(A64,Municipios!$B$2:$B$223,1,FALSE)","v":"Fonzaleche"}]
["Fuenmayor","Logroño","Fuenmayor-hasta-Logroño",13,{"$f":"VLOOKUP(A65,Municipios!$B$2:$B$223,1,FALSE)","v":"Fuenmayor"}]
["Galbárruli","Logroño",{"$f":"CONCATENATE(A66,\"-hasta-\",B66)","v":"Galbárruli-hasta-Logroño"},60,{"$f":"VLOOKUP(A66,Municipios!$B$2:$B$223,1,FALSE)","v":"Galbárruli"}]
["Galilea","Logroño","Galilea-hasta-Logroño",26,{"$f":"VLOOKUP(A67,Municipios!$B$2:$B$223,1,FALSE)","v":"Galilea"}]
["Gallinero de Cameros","Logroño","Gallinero de Cameros-hasta-Logroño",43,{"$f":"VLOOKUP(A68,Municipios!$B$2:$B$223,1,FALSE)","v":"Gallinero de Cameros"}]
["Gimileo","Logroño","Gimileo-hasta-Logroño",38,{"$f":"VLOOKUP(A69,Municipios!$B$2:$B$223,1,FALSE)","v":"Gimileo"}]
["Grañón","Logroño","Grañón-hasta-Logroño",53,{"$f":"VLOOKUP(A70,Municipios!$B$2:$B$223,1,FALSE)","v":"Grañón"}]
["Grávalos","Logroño","Grávalos-hasta-Logroño",70,{"$f":"VLOOKUP(A71,Municipios!$B$2:$B$223,1,FALSE)","v":"Grávalos"}]
["Haro","Logroño","Haro-hasta-Logroño",43,{"$f":"VLOOKUP(A72,Municipios!$B$2:$B$223,1,FALSE)","v":"Haro"}]
["Herce","Logroño","Herce-hasta-Logroño",54,{"$f":"VLOOKUP(A73,Municipios!$B$2:$B$223,1,FALSE)","v":"Herce"}]
["Herramélluri","Logroño","Herramélluri-hasta-Logroño",56,{"$f":"VLOOKUP(A74,Municipios!$B$2:$B$223,1,FALSE)","v":"Herramélluri"}]
["Hervías","Logroño","Hervías-hasta-Logroño",41,{"$f":"VLOOKUP(A75,Municipios!$B$2:$B$223,1,FALSE)","v":"Hervías"}]
["Hormilla","Logroño","Hormilla-hasta-Logroño",31,{"$f":"VLOOKUP(A76,Municipios!$B$2:$B$223,1,FALSE)","v":"Hormilla"}]
["Hormilleja","Logroño","Hormilleja-hasta-Logroño",32,{"$f":"VLOOKUP(A77,Municipios!$B$2:$B$223,1,FALSE)","v":"Hormilleja"}]
["Hornillos de Cameros","Logroño","Hornillos de Cameros-hasta-Logroño",46,{"$f":"VLOOKUP(A78,Municipios!$B$2:$B$223,1,FALSE)","v":"Hornillos de Cameros"}]
["Hornos de Moncalvillo","Logroño","Hornos de Moncalvillo-hasta-Logroño",18,{"$f":"VLOOKUP(A79,Municipios!$B$2:$B$223,1,FALSE)","v":"Hornos de Moncalvillo"}]
["Huércanos","Logroño","Huércanos-hasta-Logroño",24,{"$f":"VLOOKUP(A80,Municipios!$B$2:$B$223,1,FALSE)","v":"Huércanos"}]
["Igea","Logroño","Igea-hasta-Logroño",87,{"$f":"VLOOKUP(A81,Municipios!$B$2:$B$223,1,FALSE)","v":"Igea"}]
["Jalón de Cameros","Logroño","Jalón de Cameros-hasta-Logroño",40,{"$f":"VLOOKUP(A82,Municipios!$B$2:$B$223,1,FALSE)","v":"Jalón de Cameros"}]
["Laguna de Cameros","Logroño","Laguna de Cameros-hasta-Logroño",47,{"$f":"VLOOKUP(A83,Municipios!$B$2:$B$223,1,FALSE)","v":"Laguna de Cameros"}]
["Lagunilla del Jubera","Logroño","Lagunilla del Jubera-hasta-Logroño",25,{"$f":"VLOOKUP(A84,Municipios!$B$2:$B$223,1,FALSE)","v":"Lagunilla del Jubera"}]
["Lardero","Logroño","Lardero-hasta-Logroño",5,{"$f":"VLOOKUP(A85,Municipios!$B$2:$B$223,1,FALSE)","v":"Lardero"}]
["Ledesma de la Cogolla","Logroño","Ledesma de la Cogolla-hasta-Logroño",43,{"$f":"VLOOKUP(A86,Municipios!$B$2:$B$223,1,FALSE)","v":"Ledesma de la Cogolla"}]
["Leiva","Logroño","Leiva-hasta-Logroño",58,{"$f":"VLOOKUP(A87,Municipios!$B$2:$B$223,1,FALSE)","v":"Leiva"}]
["Leza de Río Leza","Logroño","Leza de Río Leza-hasta-Logroño",21,{"$f":"VLOOKUP(A88,Municipios!$B$2:$B$223,1,FALSE)","v":"Leza de Río Leza"}]
["Logroño","Ábalos","Logroño-hasta-Ábalos",30,{"$f":"VLOOKUP(A89,Municipios!$B$2:$B$223,1,FALSE)","v":"Logroño"}]
["Logroño","Agoncillo","Logroño-hasta-Agoncillo",14,{"$f":"VLOOKUP(A90,Municipios!$B$2:$B$223,1,FALSE)","v":"Logroño"}]
["Logroño","Aguilar del Río Alhama","Logroño-hasta-Aguilar del Río Alhama",93,{"$f":"VLOOKUP(A91,Municipios!$B$2:$B$223,1,FALSE)","v":"Logroño"}]
["Logroño","Ajamil","Logroño-hasta-Ajamil",46,{"$f":"VLOOKUP(A92,Municipios!$B$2:$B$223,1,FALSE)","v":"Logroño"}]
["Logroño","Albelda de Iregua","Logroño-hasta-Albelda de Iregua",14,{"$f":"VLOOKUP(A93,Municipios!$B$2:$B$223,1,FALSE)","v":"Logroño"}]
["Logroño","Alberite","Logroño-hasta-Alberite",8,{"$f":"VLOOKUP(A94,Municipios!$B$2:$B$223,1,FALSE)","v":"Logroño"}]
["Logroño","Alcanadre","Logroño-hasta-Alcanadre",31,{"$f":"VLOOKUP(A95,Municipios!$B$2:$B$223,1,FALSE)","v":"Logroño"}]
["Logroño","Aldeanueva de Ebro","Logroño-hasta-Aldeanueva de Ebro",58,{"$f":"VLOOKUP(A96,Municipios!$B$2:$B$223,1,FALSE)","v":"Logroño"}]
["Logroño","Alesanco","Logroño-hasta-Alesanco",36,{"$f":"VLOOKUP(A97,Municipios!$B$2:$B$223,1,FALSE)","v":"Logroño"}]
["Logroño","Alesón","Logroño-hasta-Alesón",24,{"$f":"VLOOKUP(A98,Municipios!$B$2:$B$223,1,FALSE)","v":"Logroño"}]
["Logroño","Alfaro","Logroño-hasta-Alfaro",71,{"$f":"VLOOKUP(A99,Municipios!$B$2:$B$223,1,FALSE)","v":"Logroño"}]
["Logroño","Almarza de Cameros","Logroño-hasta-Almarza de Cameros",40,{"$f":"VLOOKUP(A100,Municipios!$B$2:$B$223,1,FALSE)","v":"Logroño"}]
["Logroño","Anguciana","Logroño-hasta-Anguciana",47,{"$f":"VLOOKUP(A101,Municipios!$B$2:$B$223,1,FALSE)","v":"Logroño"}]
["Logroño","Anguiano","Logroño-hasta-Anguiano",44,{"$f":"VLOOKUP(A102,Municipios!$B$2:$B$223,1,FALSE)","v":"Logroño"}]
["Logroño","Arenzana de Abajo","Logroño-hasta-Arenzana de Abajo",28,{"$f":"VLOOKUP(A103,Municipios!$B$2:$B$223,1,FALSE)","v":"Logroño"}]
["Logroño","Arenzana de Arriba","Logroño-hasta-Arenzana de Arriba",28,{"$f":"VLOOKUP(A104,Municipios!$B$2:$B$223,1,FALSE)","v":"Logroño"}]
["Logroño","Arnedillo","Logroño-hasta-Arnedillo",61,{"$f":"VLOOKUP(A105,Municipios!$B$2:$B$223,1,FALSE)","v":"Logroño"}]
["Logroño","Arnedo","Logroño-hasta-Arnedo",49,{"$f":"VLOOKUP(A106,Municipios!$B$2:$B$223,1,FALSE)","v":"Logroño"}]
["Logroño","Arrúbal","Logroño-hasta-Arrúbal",19,{"$f":"VLOOKUP(A107,Municipios!$B$2:$B$223,1,FALSE)","v":"Logroño"}]
["Logroño","Ausejo","Logroño-hasta-Ausejo",29,{"$f":"VLOOKUP(A108,Municipios!$B$2:$B$223,1,FALSE)","v":"Logroño"}]
["Logroño","Autol","Logroño-hasta-Autol",58,{"$f":"VLOOKUP(A109,Municipios!$B$2:$B$223,1,FALSE)","v":"Logroño"}]
["Logroño","Azofra","Logroño-hasta-Azofra",34,{"$f":"VLOOKUP(A110,Municipios!$B$2:$B$223,1,FALSE)","v":"Logroño"}]
["Logroño","Badarán","Logroño-hasta-Badarán",35,{"$f":"VLOOKUP(A111,Municipios!$B$2:$B$223,1,FALSE)","v":"Logroño"}]
["Logroño","Bañares","Logroño-hasta-Bañares",45,{"$f":"VLOOKUP(A112,Municipios!$B$2:$B$223,1,FALSE)","v":"Logroño"}]
["Logroño","Baños de Río Tobía","Logroño-hasta-Baños de Río Tobía",35,{"$f":"VLOOKUP(A113,Municipios!$B$2:$B$223,1,FALSE)","v":"Logroño"}]
["Logroño","Baños de Rioja","Logroño-hasta-Baños de Rioja",51,{"$f":"VLOOKUP(A114,Municipios!$B$2:$B$223,1,FALSE)","v":"Logroño"}]
["Logroño","Berceo","Logroño-hasta-Berceo",41,{"$f":"VLOOKUP(A115,Municipios!$B$2:$B$223,1,FALSE)","v":"Logroño"}]
["Logroño","Bergasa","Logroño-hasta-Bergasa",45,{"$f":"VLOOKUP(A116,Municipios!$B$2:$B$223,1,FALSE)","v":"Logroño"}]
["Logroño","Bergasillas Bajera","Logroño-hasta-Bergasillas Bajera",48,{"$f":"VLOOKUP(A117,Municipios!$B$2:$B$223,1,FALSE)","v":"Logroño"}]
["Logroño","Bezares","Logroño-hasta-Bezares",32,{"$f":"VLOOKUP(A118,Municipios!$B$2:$B$223,1,FALSE)","v":"Logroño"}]
["Logroño","Bobadilla","Logroño-hasta-Bobadilla",37,{"$f":"VLOOKUP(A119,Municipios!$B$2:$B$223,1,FALSE)","v":"Logroño"}]
["Logroño","Brieva de Cameros","Logroño-hasta-Brieva de Cameros",65,{"$f":"VLOOKUP(A120,Municipios!$B$2:$B$223,1,FALSE)","v":"Logroño"}]
["Logroño","Briñas","Logroño-hasta-Briñas",46,{"$f":"VLOOKUP(A121,Municipios!$B$2:$B$223,1,FALSE)","v":"Logroño"}]
["Logroño","Briones","Logroño-hasta-Briones",35,{"$f":"VLOOKUP(A122,Municipios!$B$2:$B$223,1,FALSE)","v":"Logroño"}]
["Logroño","Cabezón de Cameros","Logroño-hasta-Cabezón de Cameros",43,{"$f":"VLOOKUP(A123,Municipios!$B$2:$B$223,1,FALSE)","v":"Logroño"}]
["Logroño","Calahorra","Logroño-hasta-Calahorra",47,{"$f":"VLOOKUP(A124,Municipios!$B$2:$B$223,1,FALSE)","v":"Logroño"}]
["Logroño","Camprovín","Logroño-hasta-Camprovín",34,{"$f":"VLOOKUP(A125,Municipios!$B$2:$B$223,1,FALSE)","v":"Logroño"}]
["Logroño","Canales de la Sierra","Logroño-hasta-Canales de la Sierra",83,{"$f":"VLOOKUP(A126,Municipios!$B$2:$B$223,1,FALSE)","v":"Logroño"}]
["Logroño","Canillas de Río Tuerto","Logroño-hasta-Canillas de Río Tuerto",39,{"$f":"VLOOKUP(A127,Municipios!$B$2:$B$223,1,FALSE)","v":"Logroño"}]
["Logroño","Cañas","Logroño-hasta-Cañas",40,{"$f":"VLOOKUP(A128,Municipios!$B$2:$B$223,1,FALSE)","v":"Logroño"}]
["Logroño","Cárdenas","Logroño-hasta-Cárdenas",32,{"$f":"VLOOKUP(A129,Municipios!$B$2:$B$223,1,FALSE)","v":"Logroño"}]
["Logroño","Casalarreina",{"$f":"CONCATENATE(A130,\"-hasta-\",B130)","v":"Logroño-hasta-Casalarreina"},46,{"$f":"VLOOKUP(A130,Municipios!$B$2:$B$223,1,FALSE)","v":"Logroño"}]
["Logroño","Castañares de Rioja","Logroño-hasta-Castañares de Rioja",50,{"$f":"VLOOKUP(A131,Municipios!$B$2:$B$223,1,FALSE)","v":"Logroño"}]
["Logroño","Castroviejo","Logroño-hasta-Castroviejo",35,{"$f":"VLOOKUP(A132,Municipios!$B$2:$B$223,1,FALSE)","v":"Logroño"}]
["Logroño","Cellorigo","Logroño-hasta-Cellorigo",63,{"$f":"VLOOKUP(A133,Municipios!$B$2:$B$223,1,FALSE)","v":"Logroño"}]
["Logroño","Cenicero","Logroño-hasta-Cenicero",21,{"$f":"VLOOKUP(A134,Municipios!$B$2:$B$223,1,FALSE)","v":"Logroño"}]
["Logroño","Cervera del Río Alhama","Logroño-hasta-Cervera del Río Alhama",86,{"$f":"VLOOKUP(A135,Municipios!$B$2:$B$223,1,FALSE)","v":"Logroño"}]
["Logroño","Cidamón","Logroño-hasta-Cidamón",48,{"$f":"VLOOKUP(A136,Municipios!$B$2:$B$223,1,FALSE)","v":"Logroño"}]
["Logroño","Cihuri","Logroño-hasta-Cihuri",48,{"$f":"VLOOKUP(A137,Municipios!$B$2:$B$223,1,FALSE)","v":"Logroño"}]
["Logroño","Cirueña","Logroño-hasta-Cirueña",44,{"$f":"VLOOKUP(A138,Municipios!$B$2:$B$223,1,FALSE)","v":"Logroño"}]
["Logroño","Clavijo","Logroño-hasta-Clavijo",17,{"$f":"VLOOKUP(A139,Municipios!$B$2:$B$223,1,FALSE)","v":"Logroño"}]
["Logroño","Cordovín","Logroño-hasta-Cordovín",38,{"$f":"VLOOKUP(A140,Municipios!$B$2:$B$223,1,FALSE)","v":"Logroño"}]
["Logroño","Corera","Logroño-hasta-Corera",27,{"$f":"VLOOKUP(A141,Municipios!$B$2:$B$223,1,FALSE)","v":"Logroño"}]
["Logroño","Cornago","Logroño-hasta-Cornago",73,{"$f":"VLOOKUP(A142,Municipios!$B$2:$B$223,1,FALSE)","v":"Logroño"}]
["Logroño","Corporales","Logroño-hasta-Corporales",50,{"$f":"VLOOKUP(A143,Municipios!$B$2:$B$223,1,FALSE)","v":"Logroño"}]
["Logroño","Cuzcurrita de Río Tirón","Logroño-hasta-Cuzcurrita de Río Tirón",51,{"$f":"VLOOKUP(A144,Municipios!$B$2:$B$223,1,FALSE)","v":"Logroño"}]
["Logroño","Daroca de Rioja","Logroño-hasta-Daroca de Rioja",20,{"$f":"VLOOKUP(A145,Municipios!$B$2:$B$223,1,FALSE)","v":"Logroño"}]
["Logroño","Enciso","Logroño-hasta-Enciso",71,{"$f":"VLOOKUP(A146,Municipios!$B$2:$B$223,1,FALSE)","v":"Logroño"}]
["Logroño","Entrena","Logroño-hasta-Entrena",13,{"$f":"VLOOKUP(A147,Municipios!$B$2:$B$223,1,FALSE)","v":"Logroño"}]
["Logroño","Estollo","Logroño-hasta-Estollo",43,{"$f":"VLOOKUP(A148,Municipios!$B$2:$B$223,1,FALSE)","v":"Logroño"}]
["Logroño","Ezcaray","Logroño-hasta-Ezcaray",60,{"$f":"VLOOKUP(A149,Municipios!$B$2:$B$223,1,FALSE)","v":"Logroño"}]
["Logroño","Foncea","Logroño-hasta-Foncea",62,{"$f":"VLOOKUP(A150,Municipios!$B$2:$B$223,1,FALSE)","v":"Logroño"}]
["Logroño","Fonzaleche","Logroño-hasta-Fonzaleche",57,{"$f":"VLOOKUP(A151,Municipios!$B$2:$B$223,1,FALSE)","v":"Logroño"}]
["Logroño","Fuenmayor","Logroño-hasta-Fuenmayor",13,{"$f":"VLOOKUP(A152,Municipios!$B$2:$B$223,1,FALSE)","v":"Logroño"}]
["Logroño","Galbárruli","Logroño-hasta-Galbárruli",60,{"$f":"VLOOKUP(A153,Municipios!$B$2:$B$223,1,FALSE)","v":"Logroño"}]
["Logroño","Galilea","Logroño-hasta-Galilea",26,{"$f":"VLOOKUP(A154,Municipios!$B$2:$B$223,1,FALSE)","v":"Logroño"}]
["Logroño","Gallinero de Cameros","Logroño-hasta-Gallinero de Cameros",43,{"$f":"VLOOKUP(A155,Municipios!$B$2:$B$223,1,FALSE)","v":"Logroño"}]
["Logroño","Gimileo","Logroño-hasta-Gimileo",38,{"$f":"VLOOKUP(A156,Municipios!$B$2:$B$223,1,FALSE)","v":"Logroño"}]
["Logroño","Grañón","Logroño-hasta-Grañón",53,{"$f":"VLOOKUP(A157,Municipios!$B$2:$B$223,1,FALSE)","v":"Logroño"}]
["Logroño","Grávalos","Logroño-hasta-Grávalos",70,{"$f":"VLOOKUP(A158,Municipios!$B$2:$B$223,1,FALSE)","v":"Logroño"}]
["Logroño","Haro","Logroño-hasta-Haro",43,{"$f":"VLOOKUP(A159,Municipios!$B$2:$B$223,1,FALSE)","v":"Logroño"}]
["Logroño","Herce","Logroño-hasta-Herce",54,{"$f":"VLOOKUP(A160,Municipios!$B$2:$B$223,1,FALSE)","v":"Logroño"}]
["Logroño","Herramélluri","Logroño-hasta-Herramélluri",56,{"$f":"VLOOKUP(A161,Municipios!$B$2:$B$223,1,FALSE)","v":"Logroño"}]
["Logroño","Hervías","Logroño-hasta-Hervías",41,{"$f":"VLOOKUP(A162,Municipios!$B$2:$B$223,1,FALSE)","v":"Logroño"}]
["Logroño","Hormilla","Logroño-hasta-Hormilla",31,{"$f":"VLOOKUP(A163,Municipios!$B$2:$B$223,1,FALSE)","v":"Logroño"}]
["Logroño","Hormilleja","Logroño-hasta-Hormilleja",32,{"$f":"VLOOKUP(A164,Municipios!$B$2:$B$223,1,FALSE)","v":"Logroño"}]
["Logroño","Hornillos de Cameros","Logroño-hasta-Hornillos de Cameros",46,{"$f":"VLOOKUP(A165,Municipios!$B$2:$B$223,1,FALSE)","v":"Logroño"}]
["Logroño","Hornos de Moncalvillo","Logroño-hasta-Hornos de Moncalvillo",18,{"$f":"VLOOKUP(A166,Municipios!$B$2:$B$223,1,FALSE)","v":"Logroño"}]
["Logroño","Huércanos","Logroño-hasta-Huércanos",24,{"$f":"VLOOKUP(A167,Municipios!$B$2:$B$223,1,FALSE)","v":"Logroño"}]
["Logroño","Igea","Logroño-hasta-Igea",87,{"$f":"VLOOKUP(A168,Municipios!$B$2:$B$223,1,FALSE)","v":"Logroño"}]
["Logroño","Jalón de Cameros","Logroño-hasta-Jalón de Cameros",40,{"$f":"VLOOKUP(A169,Municipios!$B$2:$B$223,1,FALSE)","v":"Logroño"}]
["Logroño","Laguna de Cameros","Logroño-hasta-Laguna de Cameros",47,{"$f":"VLOOKUP(A170,Municipios!$B$2:$B$223,1,FALSE)","v":"Logroño"}]
["Logroño","Lagunilla del Jubera","Logroño-hasta-Lagunilla del Jubera",25,{"$f":"VLOOKUP(A171,Municipios!$B$2:$B$223,1,FALSE)","v":"Logroño"}]
["Logroño","Lardero","Logroño-hasta-Lardero",5,{"$f":"VLOOKUP(A172,Municipios!$B$2:$B$223,1,FALSE)","v":"Logroño"}]
["Logroño","Ledesma de la Cogolla","Logroño-hasta-Ledesma de la Cogolla",43,{"$f":"VLOOKUP(A173,Municipios!$B$2:$B$223,1,FALSE)","v":"Logroño"}]
["Logroño","Leiva","Logroño-hasta-Leiva",58,{"$f":"VLOOKUP(A174,Municipios!$B$2:$B$223,1,FALSE)","v":"Logroño"}]
["Logroño","Leza de Río Leza","Logroño-hasta-Leza de Río Leza",21,{"$f":"VLOOKUP(A175,Municipios!$B$2:$B$223,1,FALSE)","v":"Logroño"}]
["Logroño","Logroño","Logroño-hasta-Logroño",0,{"$f":"VLOOKUP(A176,Municipios!$B$2:$B$223,1,FALSE)","v":"Logroño"}]
["Logroño","Lumbreras","Logroño-hasta-Lumbreras",53,{"$f":"VLOOKUP(A177,Municipios!$B$2:$B$223,1,FALSE)","v":"Logroño"}]
["Logroño","Manjarrés","Logroño-hasta-Manjarrés",26,{"$f":"VLOOKUP(A178,Municipios!$B$2:$B$223,1,FALSE)","v":"Logroño"}]
["Logroño","Mansilla de la Sierra","Logroño-hasta-Mansilla de la Sierra",74,{"$f":"VLOOKUP(A179,Municipios!$B$2:$B$223,1,FALSE)","v":"Logroño"}]
["Logroño","Manzanares de Rioja","Logroño-hasta-Manzanares de Rioja",44,{"$f":"VLOOKUP(A180,Municipios!$B$2:$B$223,1,FALSE)","v":"Logroño"}]
["Logroño","Matute","Logroño-hasta-Matute",41,{"$f":"VLOOKUP(A181,Municipios!$B$2:$B$223,1,FALSE)","v":"Logroño"}]
["Logroño","Medrano","Logroño-hasta-Medrano",18,{"$f":"VLOOKUP(A182,Municipios!$B$2:$B$223,1,FALSE)","v":"Logroño"}]
["Logroño","Munilla","Logroño-hasta-Munilla",68,{"$f":"VLOOKUP(A183,Municipios!$B$2:$B$223,1,FALSE)","v":"Logroño"}]
["Logroño","Murillo de Río Leza","Logroño-hasta-Murillo de Río Leza",16,{"$f":"VLOOKUP(A184,Municipios!$B$2:$B$223,1,FALSE)","v":"Logroño"}]
["Logroño","Muro de Aguas","Logroño-hasta-Muro de Aguas",66,{"$f":"VLOOKUP(A185,Municipios!$B$2:$B$223,1,FALSE)","v":"Logroño"}]
["Logroño","Muro en Cameros","Logroño-hasta-Muro en Cameros",44,{"$f":"VLOOKUP(A186,Municipios!$B$2:$B$223,1,FALSE)","v":"Logroño"}]
["Logroño","Nájera","Logroño-hasta-Nájera",27,{"$f":"VLOOKUP(A187,Municipios!$B$2:$B$223,1,FALSE)","v":"Logroño"}]
["Logroño","Nalda","Logroño-hasta-Nalda",17,{"$f":"VLOOKUP(A188,Municipios!$B$2:$B$223,1,FALSE)","v":"Logroño"}]
["Logroño","Navajún","Logroño-hasta-Navajún",105,{"$f":"VLOOKUP(A189,Municipios!$B$2:$B$223,1,FALSE)","v":"Logroño"}]
["Logroño","Navarrete","Logroño-hasta-Navarrete",11,{"$f":"VLOOKUP(A190,Municipios!$B$2:$B$223,1,FALSE)","v":"Logroño"}]
["Logroño","Nestares","Logroño-hasta-Nestares",31,{"$f":"VLOOKUP(A191,Municipios!$B$2:$B$223,1,FALSE)","v":"Logroño"}]
["Logroño","Nieva de Cameros","Logroño-hasta-Nieva de Cameros",41,{"$f":"VLOOKUP(A192,Municipios!$B$2:$B$223,1,FALSE)","v":"Logroño"}]
["Logroño","Ochánduri","Logroño-hasta-Ochánduri",55,{"$f":"VLOOKUP(A193,Municipios!$B$2:$B$223,1,FALSE)","v":"Logroño"}]
["Logroño","Ocón",{"$f":"CONCATENATE(A194,\"-hasta-\",B194)","v":"Logroño-hasta-Ocón"},33,{"$f":"VLOOKUP(A194,Municipios!$B$2:$B$223,1,FALSE)","v":"Logroño"}]
["Logroño","Ojacastro","Logroño-hasta-Ojacastro",57,{"$f":"VLOOKUP(A195,Municipios!$B$2:$B$223,1,FALSE)","v":"Logroño"}]
["Logroño","Ollauri","Logroño-hasta-Ollauri",40,{"$f":"VLOOKUP(A196,Municipios!$B$2:$B$223,1,FALSE)","v":"Logroño"}]
["Logroño","Ortigosa de Cameros","Logroño-hasta-Ortigosa de Cameros",50,{"$f":"VLOOKUP(A197,Municipios!$B$2:$B$223,1,FALSE)","v":"Logroño"}]
["Logroño","Pazuengos","Logroño-hasta-Pazuengos",59,{"$f":"VLOOKUP(A198,Municipios!$B$2:$B$223,1,FALSE)","v":"Logroño"}]
["Logroño","Pedroso","Logroño-hasta-Pedroso",43,{"$f":"VLOOKUP(A199,Municipios!$B$2:$B$223,1,FALSE)","v":"Logroño"}]
["Logroño","Pinillos","Logroño-hasta-Pinillos",40,{"$f":"VLOOKUP(A200,Municipios!$B$2:$B$223,1,FALSE)","v":"Logroño"}]
["Logroño","Pradejón","Logroño-hasta-Pradejón",42,{"$f":"VLOOKUP(A201,Municipios!$B$2:$B$223,1,FALSE)","v":"Logroño"}]
["Logroño","Pradillo","Logroño-hasta-Pradillo",41,{"$f":"VLOOKUP(A202,Municipios!$B$2:$B$223,1,FALSE)","v":"Logroño"}]
["Logroño","Préjano","Logroño-hasta-Préjano",59,{"$f":"VLOOKUP(A203,Municipios!$B$2:$B$223,1,FALSE)","v":"Logroño"}]
["Logroño","Quel","Logroño-hasta-Quel",49,{"$f":"VLOOKUP(A204,Municipios!$B$2:$B$223,1,FALSE)","v":"Logroño"}]
["Logroño","Rabanera","Logroño-hasta-Rabanera",44,{"$f":"VLOOKUP(A205,Municipios!$B$2:$B$223,1,FALSE)","v":"Logroño"}]
["Logroño","Rasillo de Cameros (El)","Logroño-hasta-Rasillo de Cameros (El)",43,{"$f":"VLOOKUP(A206,Municipios!$B$2:$B$223,1,FALSE)","v":"Logroño"}]
["Logroño","Redal (El)","Logroño-hasta-Redal (El)",30,{"$f":"VLOOKUP(A207,Municipios!$B$2:$B$223,1,FALSE)","v":"Logroño"}]
["Logroño","Ribafrecha","Logroño-hasta-Ribafrecha",15,{"$f":"VLOOKUP(A208,Municipios!$B$2:$B$223,1,FALSE)","v":"Logroño"}]
["Logroño","Rincón de Soto","Logroño-hasta-Rincón de Soto",61,{"$f":"VLOOKUP(A209,Municipios!$B$2:$B$223,1,FALSE)","v":"Logroño"}]
["Logroño","Robres del Castillo","Logroño-hasta-Robres del Castillo",33,{"$f":"VLOOKUP(A210,Municipios!$B$2:$B$223,1,FALSE)","v":"Logroño"}]
["Logroño","Rodezno","Logroño-hasta-Rodezno",42,{"$f":"VLOOKUP(A211,Municipios!$B$2:$B$223,1,FALSE)","v":"Logroño"}]
["Logroño","Sajazarra","Logroño-hasta-Sajazarra",54,{"$f":"VLOOKUP(A212,Municipios!$B$2:$B$223,1,FALSE)","v":"Logroño"}]
["Logroño","San Asensio","Logroño-hasta-San Asensio",33,{"$f":"VLOOKUP(A213,Municipios!$B$2:$B$223,1,FALSE)","v":"Logroño"}]
["Logroño","San Millán de la Cogolla","Logroño-hasta-San Millán de la Cogolla",42,{"$f":"VLOOKUP(A214,Municipios!$B$2:$B$223,1,FALSE)","v":"Logroño"}]
["Logroño","San Millán de Yécora","Logroño-hasta-San Millán de Yécora",63,{"$f":"VLOOKUP(A215,Municipios!$B$2:$B$223,1,FALSE)","v":"Logroño"}]
["Logroño","San Román de Cameros","Logroño-hasta-San Román de Cameros",37,{"$f":"VLOOKUP(A216,Municipios!$B$2:$B$223,1,FALSE)","v":"Logroño"}]
["Logroño","San Torcuato","Logroño-hasta-San Torcuato",47,{"$f":"VLOOKUP(A217,Municipios!$B$2:$B$223,1,FALSE)","v":"Logroño"}]
["Logroño","San Vicente de la Sonsierra","Logroño-hasta-San Vicente de la Sonsierra",39,{"$f":"VLOOKUP(A218,Municipios!$B$2:$B$223,1,FALSE)","v":"Logroño"}]
["Logroño","Santa Coloma","Logroño-hasta-Santa Coloma",28,{"$f":"VLOOKUP(A219,Municipios!$B$2:$B$223,1,FALSE)","v":"Logroño"}]
["Logroño","Santa Engracia del Jubera","Logroño-hasta-Santa Engracia del Jubera",27,{"$f":"VLOOKUP(A220,Municipios!$B$2:$B$223,1,FALSE)","v":"Logroño"}]
["Logroño","Santa Eulalia Bajera","Logroño-hasta-Santa Eulalia Bajera",57,{"$f":"VLOOKUP(A221,Municipios!$B$2:$B$223,1,FALSE)","v":"Logroño"}]
["Logroño","Santo Domingo de la Calzada","Logroño-hasta-Santo Domingo de la Calzada",46,{"$f":"VLOOKUP(A222,Municipios!$B$2:$B$223,1,FALSE)","v":"Logroño"}]
["Logroño","Santurde de Rioja","Logroño-hasta-Santurde de Rioja",53,{"$f":"VLOOKUP(A223,Municipios!$B$2:$B$223,1,FALSE)","v":"Logroño"}]
["Logroño","Santurdejo","Logroño-hasta-Santurdejo",54,{"$f":"VLOOKUP(A224,Municipios!$B$2:$B$223,1,FALSE)","v":"Logroño"}]
["Logroño","Sojuela","Logroño-hasta-Sojuela",16,{"$f":"VLOOKUP(A225,Municipios!$B$2:$B$223,1,FALSE)","v":"Logroño"}]
["Logroño","Sorzano","Logroño-hasta-Sorzano",18,{"$f":"VLOOKUP(A226,Municipios!$B$2:$B$223,1,FALSE)","v":"Logroño"}]
["Logroño","Sotés","Logroño-hasta-Sotés",17,{"$f":"VLOOKUP(A227,Municipios!$B$2:$B$223,1,FALSE)","v":"Logroño"}]
["Logroño","Soto en Cameros","Logroño-hasta-Soto en Cameros",28,{"$f":"VLOOKUP(A228,Municipios!$B$2:$B$223,1,FALSE)","v":"Logroño"}]
["Logroño","Terroba","Logroño-hasta-Terroba",38,{"$f":"VLOOKUP(A229,Municipios!$B$2:$B$223,1,FALSE)","v":"Logroño"}]
["Logroño","Tirgo","Logroño-hasta-Tirgo",49,{"$f":"VLOOKUP(A230,Municipios!$B$2:$B$223,1,FALSE)","v":"Logroño"}]
["Logroño","Tobía","Logroño-hasta-Tobía",43,{"$f":"VLOOKUP(A231,Municipios!$B$2:$B$223,1,FALSE)","v":"Logroño"}]
["Logroño","Tormantos","Logroño-hasta-Tormantos",61,{"$f":"VLOOKUP(A232,Municipios!$B$2:$B$223,1,FALSE)","v":"Logroño"}]
["Logroño","Torre en Cameros","Logroño-hasta-Torre en Cameros",50,{"$f":"VLOOKUP(A233,Municipios!$B$2:$B$223,1,FALSE)","v":"Logroño"}]
["Logroño","Torrecilla en Cameros","Logroño-hasta-Torrecilla en Cameros",31,{"$f":"VLOOKUP(A234,Municipios!$B$2:$B$223,1,FALSE)","v":"Logroño"}]
["Logroño","Torrecilla sobre Alesanco","Logroño-hasta-Torrecilla sobre Alesanco",38,{"$f":"VLOOKUP(A235,Municipios!$B$2:$B$223,1,FALSE)","v":"Logroño"}]
["Logroño","Torremontalbo","Logroño-hasta-Torremontalbo",25,{"$f":"VLOOKUP(A236,Municipios!$B$2:$B$223,1,FALSE)","v":"Logroño"}]
["Logroño","Treviana","Logroño-hasta-Treviana",59,{"$f":"VLOOKUP(A237,Municipios!$B$2:$B$223,1,FALSE)","v":"Logroño"}]
["Logroño","Tricio","Logroño-hasta-Tricio",26,{"$f":"VLOOKUP(A238,Municipios!$B$2:$B$223,1,FALSE)","v":"Logroño"}]
["Logroño","Tudelilla","Logroño-hasta-Tudelilla",37,{"$f":"VLOOKUP(A239,Municipios!$B$2:$B$223,1,FALSE)","v":"Logroño"}]
["Logroño","Uruñuela","Logroño-hasta-Uruñuela",26,{"$f":"VLOOKUP(A240,Municipios!$B$2:$B$223,1,FALSE)","v":"Logroño"}]
["Logroño","Valdemadera","Logroño-hasta-Valdemadera",102,{"$f":"VLOOKUP(A241,Municipios!$B$2:$B$223,1,FALSE)","v":"Logroño"}]
["Logroño","Valgañón","Logroño-hasta-Valgañón",65,{"$f":"VLOOKUP(A242,Municipios!$B$2:$B$223,1,FALSE)","v":"Logroño"}]
["Logroño","Ventosa","Logroño-hasta-Ventosa",19,{"$f":"VLOOKUP(A243,Municipios!$B$2:$B$223,1,FALSE)","v":"Logroño"}]
["Logroño","Ventrosa","Logroño-hasta-Ventrosa",70,{"$f":"VLOOKUP(A244,Municipios!$B$2:$B$223,1,FALSE)","v":"Logroño"}]
["Logroño","Viguera","Logroño-hasta-Viguera",22,{"$f":"VLOOKUP(A245,Municipios!$B$2:$B$223,1,FALSE)","v":"Logroño"}]
["Logroño","Villalba de Rioja","Logroño-hasta-Villalba de Rioja",50,{"$f":"VLOOKUP(A246,Municipios!$B$2:$B$223,1,FALSE)","v":"Logroño"}]
["Logroño","Villalobar de Rioja","Logroño-hasta-Villalobar de Rioja",52,{"$f":"VLOOKUP(A247,Municipios!$B$2:$B$223,1,FALSE)","v":"Logroño"}]
["Logroño","Villamediana de Iregua","Logroño-hasta-Villamediana de Iregua",6,{"$f":"VLOOKUP(A248,Municipios!$B$2:$B$223,1,FALSE)","v":"Logroño"}]
["Logroño","Villanueva de Cameros","Logroño-hasta-Villanueva de Cameros",42,{"$f":"VLOOKUP(A249,Municipios!$B$2:$B$223,1,FALSE)","v":"Logroño"}]
["Logroño","Villar de Arnedo (El)","Logroño-hasta-Villar de Arnedo (El)",36,{"$f":"VLOOKUP(A250,Municipios!$B$2:$B$223,1,FALSE)","v":"Logroño"}]
["Logroño","Villar de Torre","Logroño-hasta-Villar de Torre",43,{"$f":"VLOOKUP(A251,Municipios!$B$2:$B$223,1,FALSE)","v":"Logroño"}]
["Logroño","Villarejo","Logroño-hasta-Villarejo",46,{"$f":"VLOOKUP(A252,Municipios!$B$2:$B$223,1,FALSE)","v":"Logroño"}]
["Logroño","Villarroya","Logroño-hasta-Villarroya",63,{"$f":"VLOOKUP(A253,Municipios!$B$2:$B$223,1,FALSE)","v":"Logroño"}]
["Logroño","Villarta-Quintana","Logroño-hasta-Villarta-Quintana",56,{"$f":"VLOOKUP(A254,Municipios!$B$2:$B$223,1,FALSE)","v":"Logroño"}]
["Logroño","Villavelayo","Logroño-hasta-Villavelayo",79,{"$f":"VLOOKUP(A255,Municipios!$B$2:$B$223,1,FALSE)","v":"Logroño"}]
["Logroño","Villaverde de Rioja","Logroño-hasta-Villaverde de Rioja",43,{"$f":"VLOOKUP(A256,Municipios!$B$2:$B$223,1,FALSE)","v":"Logroño"}]
["Logroño","Villoslada de Cameros",{"$f":"CONCATENATE(A257,\"-hasta-\",B257)","v":"Logroño-hasta-Villoslada de Cameros"},50,{"$f":"VLOOKUP(A257,Municipios!$B$2:$B$223,1,FALSE)","v":"Logroño"}]
["Logroño","Viniegra de Abajo","Logroño-hasta-Viniegra de Abajo",68,{"$f":"VLOOKUP(A258,Municipios!$B$2:$B$223,1,FALSE)","v":"Logroño"}]
["Logroño","Viniegra de Arriba","Logroño-hasta-Viniegra de Arriba",78,{"$f":"VLOOKUP(A259,Municipios!$B$2:$B$223,1,FALSE)","v":"Logroño"}]
["Logroño","Vitoria-Gasteiz","Logroño-hasta-Vitoria-Gasteiz",89,{"$f":"VLOOKUP(A260,Municipios!$B$2:$B$223,1,FALSE)","v":"Logroño"}]
["Logroño","Zarratón","Logroño-hasta-Zarratón",45,{"$f":"VLOOKUP(A261,Municipios!$B$2:$B$223,1,FALSE)","v":"Logroño"}]
["Logroño","Zarzosa","Logroño-hasta-Zarzosa",72,{"$f":"VLOOKUP(A262,Municipios!$B$2:$B$223,1,FALSE)","v":"Logroño"}]
["Logroño","Zorraquín","Logroño-hasta-Zorraquín",62,{"$f":"VLOOKUP(A263,Municipios!$B$2:$B$223,1,FALSE)","v":"Logroño"}]
["Lumbreras","Logroño","Lumbreras-hasta-Logroño",53,{"$f":"VLOOKUP(A264,Municipios!$B$2:$B$223,1,FALSE)","v":"Lumbreras"}]
["Manjarrés","Logroño","Manjarrés-hasta-Logroño",26,{"$f":"VLOOKUP(A265,Municipios!$B$2:$B$223,1,FALSE)","v":"Manjarrés"}]
["Mansilla de la Sierra","Logroño","Mansilla de la Sierra-hasta-Logroño",74,{"$f":"VLOOKUP(A266,Municipios!$B$2:$B$223,1,FALSE)","v":"Mansilla de la Sierra"}]
["Manzanares de Rioja","Logroño","Manzanares de Rioja-hasta-Logroño",44,{"$f":"VLOOKUP(A267,Municipios!$B$2:$B$223,1,FALSE)","v":"Manzanares de Rioja"}]
["Matute","Logroño","Matute-hasta-Logroño",41,{"$f":"VLOOKUP(A268,Municipios!$B$2:$B$223,1,FALSE)","v":"Matute"}]
["Medrano","Logroño","Medrano-hasta-Logroño",18,{"$f":"VLOOKUP(A269,Municipios!$B$2:$B$223,1,FALSE)","v":"Medrano"}]
["Munilla","Logroño","Munilla-hasta-Logroño",68,{"$f":"VLOOKUP(A270,Municipios!$B$2:$B$223,1,FALSE)","v":"Munilla"}]
["Murillo de Río Leza","Logroño","Murillo de Río Leza-hasta-Logroño",16,{"$f":"VLOOKUP(A271,Municipios!$B$2:$B$223,1,FALSE)","v":"Murillo de Río Leza"}]
["Muro de Aguas","Logroño","Muro de Aguas-hasta-Logroño",66,{"$f":"VLOOKUP(A272,Municipios!$B$2:$B$223,1,FALSE)","v":"Muro de Aguas"}]
["Muro en Cameros","Logroño","Muro en Cameros-hasta-Logroño",44,{"$f":"VLOOKUP(A273,Municipios!$B$2:$B$223,1,FALSE)","v":"Muro en Cameros"}]
["Nájera","Logroño","Nájera-hasta-Logroño",27,{"$f":"VLOOKUP(A274,Municipios!$B$2:$B$223,1,FALSE)","v":"Nájera"}]
["Nalda","Logroño","Nalda-hasta-Logroño",17,{"$f":"VLOOKUP(A275,Municipios!$B$2:$B$223,1,FALSE)","v":"Nalda"}]
["Navajún","Logroño","Navajún-hasta-Logroño",105,{"$f":"VLOOKUP(A276,Municipios!$B$2:$B$223,1,FALSE)","v":"Navajún"}]
["Navarrete","Logroño","Navarrete-hasta-Logroño",11,{"$f":"VLOOKUP(A277,Municipios!$B$2:$B$223,1,FALSE)","v":"Navarrete"}]
["Nestares","Logroño","Nestares-hasta-Logroño",31,{"$f":"VLOOKUP(A278,Municipios!$B$2:$B$223,1,FALSE)","v":"Nestares"}]
["Nieva de Cameros","Logroño","Nieva de Cameros-hasta-Logroño",41,{"$f":"VLOOKUP(A279,Municipios!$B$2:$B$223,1,FALSE)","v":"Nieva de Cameros"}]
["Ochánduri","Logroño","Ochánduri-hasta-Logroño",55,{"$f":"VLOOKUP(A280,Municipios!$B$2:$B$223,1,FALSE)","v":"Ochánduri"}]
["Ocón","Logroño","Ocón-hasta-Logroño",33,{"$f":"VLOOKUP(A281,Municipios!$B$2:$B$223,1,FALSE)","v":"Ocón"}]
["Ojacastro","Logroño","Ojacastro-hasta-Logroño",57,{"$f":"VLOOKUP(A282,Municipios!$B$2:$B$223,1,FALSE)","v":"Ojacastro"}]
["Ollauri","Logroño","Ollauri-hasta-Logroño",40,{"$f":"VLOOKUP(A283,Municipios!$B$2:$B$223,1,FALSE)","v":"Ollauri"}]
["Ortigosa de Cameros","Logroño","Ortigosa de Cameros-hasta-Logroño",50,{"$f":"VLOOKUP(A284,Municipios!$B$2:$B$223,1,FALSE)","v":"Ortigosa de Cameros"}]
["Pazuengos","Logroño","Pazuengos-hasta-Logroño",59,{"$f":"VLOOKUP(A285,Municipios!$B$2:$B$223,1,FALSE)","v":"Pazuengos"}]
["Pedroso","Logroño","Pedroso-hasta-Logroño",43,{"$f":"VLOOKUP(A286,Municipios!$B$2:$B$223,1,FALSE)","v":"Pedroso"}]
["Pinillos","Logroño","Pinillos-hasta-Logroño",40,{"$f":"VLOOKUP(A287,Municipios!$B$2:$B$223,1,FALSE)","v":"Pinillos"}]
["Pradejón","Logroño","Pradejón-hasta-Logroño",42,{"$f":"VLOOKUP(A288,Municipios!$B$2:$B$223,1,FALSE)","v":"Pradejón"}]
["Pradillo","Logroño","Pradillo-hasta-Logroño",41,{"$f":"VLOOKUP(A289,Municipios!$B$2:$B$223,1,FALSE)","v":"Pradillo"}]
["Préjano","Logroño","Préjano-hasta-Logroño",59,{"$f":"VLOOKUP(A290,Municipios!$B$2:$B$223,1,FALSE)","v":"Préjano"}]
["Quel","Logroño","Quel-hasta-Logroño",49,{"$f":"VLOOKUP(A291,Municipios!$B$2:$B$223,1,FALSE)","v":"Quel"}]
["Rabanera","Logroño","Rabanera-hasta-Logroño",44,{"$f":"VLOOKUP(A292,Municipios!$B$2:$B$223,1,FALSE)","v":"Rabanera"}]
["Rasillo de Cameros (El)","Logroño","Rasillo de Cameros (El)-hasta-Logroño",43,{"$f":"VLOOKUP(A293,Municipios!$B$2:$B$223,1,FALSE)","v":"Rasillo de Cameros (El)"}]
["Redal (El)","Logroño","Redal (El)-hasta-Logroño",30,{"$f":"VLOOKUP(A294,Municipios!$B$2:$B$223,1,FALSE)","v":"Redal (El)"}]
["Ribafrecha","Logroño","Ribafrecha-hasta-Logroño",15,{"$f":"VLOOKUP(A295,Municipios!$B$2:$B$223,1,FALSE)","v":"Ribafrecha"}]
["Rincón de Soto","Logroño","Rincón de Soto-hasta-Logroño",61,{"$f":"VLOOKUP(A296,Municipios!$B$2:$B$223,1,FALSE)","v":"Rincón de Soto"}]
["Robres del Castillo","Logroño","Robres del Castillo-hasta-Logroño",33,{"$f":"VLOOKUP(A297,Municipios!$B$2:$B$223,1,FALSE)","v":"Robres del Castillo"}]
["Rodezno","Logroño","Rodezno-hasta-Logroño",42,{"$f":"VLOOKUP(A298,Municipios!$B$2:$B$223,1,FALSE)","v":"Rodezno"}]
["Sajazarra","Logroño","Sajazarra-hasta-Logroño",54,{"$f":"VLOOKUP(A299,Municipios!$B$2:$B$223,1,FALSE)","v":"Sajazarra"}]
["San Asensio","Logroño","San Asensio-hasta-Logroño",33,{"$f":"VLOOKUP(A300,Municipios!$B$2:$B$223,1,FALSE)","v":"San Asensio"}]
["San Millán de la Cogolla","Logroño","San Millán de la Cogolla-hasta-Logroño",42,{"$f":"VLOOKUP(A301,Municipios!$B$2:$B$223,1,FALSE)","v":"San Millán de la Cogolla"}]
["San Millán de Yécora","Logroño","San Millán de Yécora-hasta-Logroño",63,{"$f":"VLOOKUP(A302,Municipios!$B$2:$B$223,1,FALSE)","v":"San Millán de Yécora"}]
["San Román de Cameros","Logroño","San Román de Cameros-hasta-Logroño",37,{"$f":"VLOOKUP(A303,Municipios!$B$2:$B$223,1,FALSE)","v":"San Román de Cameros"}]
["San Torcuato","Logroño","San Torcuato-hasta-Logroño",47,{"$f":"VLOOKUP(A304,Municipios!$B$2:$B$223,1,FALSE)","v":"San Torcuato"}]
["San Vicente de la Sonsierra","Logroño","San Vicente de la Sonsierra-hasta-Logroño",39,{"$f":"VLOOKUP(A305,Municipios!$B$2:$B$223,1,FALSE)","v":"San Vicente de la Sonsierra"}]
["Santa Coloma","Logroño","Santa Coloma-hasta-Logroño",28,{"$f":"VLOOKUP(A306,Municipios!$B$2:$B$223,1,FALSE)","v":"Santa Coloma"}]
["Santa Engracia del Jubera","Logroño","Santa Engracia del Jubera-hasta-Logroño",27,{"$f":"VLOOKUP(A307,Municipios!$B$2:$B$223,1,FALSE)","v":"Santa Engracia del Jubera"}]
["Santa Eulalia Bajera","Logroño","Santa Eulalia Bajera-hasta-Logroño",57,{"$f":"VLOOKUP(A308,Municipios!$B$2:$B$223,1,FALSE)","v":"Santa Eulalia Bajera"}]
["Santo Domingo de la Calzada","Logroño","Santo Domingo de la Calzada-hasta-Logroño",46,{"$f":"VLOOKUP(A309,Municipios!$B$2:$B$223,1,FALSE)","v":"Santo Domingo de la Calzada"}]
["Santurde de Rioja","Logroño","Santurde de Rioja-hasta-Logroño",53,{"$f":"VLOOKUP(A310,Municipios!$B$2:$B$223,1,FALSE)","v":"Santurde de Rioja"}]
["Santurdejo","Logroño","Santurdejo-hasta-Logroño",54,{"$f":"VLOOKUP(A311,Municipios!$B$2:$B$223,1,FALSE)","v":"Santurdejo"}]
["Sojuela","Logroño","Sojuela-hasta-Logroño",16,{"$f":"VLOOKUP(A312,Municipios!$B$2:$B$223,1,FALSE)","v":"Sojuela"}]
["Sorzano","Logroño","Sorzano-hasta-Logroño",18,{"$f":"VLOOKUP(A313,Municipios!$B$2:$B$223,1,FALSE)","v":"Sorzano"}]
["Sotés","Logroño","Sotés-hasta-Logroño",17,{"$f":"VLOOKUP(A314,Municipios!$B$2:$B$223,1,FALSE)","v":"Sotés"}]
["Soto en Cameros","Logroño","Soto en Cameros-hasta-Logroño",28,{"$f":"VLOOKUP(A315,Municipios!$B$2:$B$223,1,FALSE)","v":"Soto en Cameros"}]
["Terroba","Logroño","Terroba-hasta-Logroño",38,{"$f":"VLOOKUP(A316,Municipios!$B$2:$B$223,1,FALSE)","v":"Terroba"}]
["Tirgo","Logroño","Tirgo-hasta-Logroño",49,{"$f":"VLOOKUP(A317,Municipios!$B$2:$B$223,1,FALSE)","v":"Tirgo"}]
["Tobía","Logroño","Tobía-hasta-Logroño",43,{"$f":"VLOOKUP(A318,Municipios!$B$2:$B$223,1,FALSE)","v":"Tobía"}]
["Tormantos","Logroño","Tormantos-hasta-Logroño",61,{"$f":"VLOOKUP(A319,Municipios!$B$2:$B$223,1,FALSE)","v":"Tormantos"}]
["Torre en Cameros","Logroño",{"$f":"CONCATENATE(A320,\"-hasta-\",B320)","v":"Torre en Cameros-hasta-Logroño"},50,{"$f":"VLOOKUP(A320,Municipios!$B$2:$B$223,1,FALSE)","v":"Torre en Cameros"}]
["Torrecilla en Cameros","Logroño","Torrecilla en Cameros-hasta-Logroño",31,{"$f":"VLOOKUP(A321,Municipios!$B$2:$B$223,1,FALSE)","v":"Torrecilla en Cameros"}]
["Torrecilla sobre Alesanco","Logroño","Torrecilla sobre Alesanco-hasta-Logroño",38,{"$f":"VLOOKUP(A322,Municipios!$B$2:$B$223,1,FALSE)","v":"Torrecilla sobre Alesanco"}]
["Torremontalbo","Logroño","Torremontalbo-hasta-Logroño",25,{"$f":"VLOOKUP(A323,Municipios!$B$2:$B$223,1,FALSE)","v":"Torremontalbo"}]
["Treviana","Logroño","Treviana-hasta-Logroño",59,{"$f":"VLOOKUP(A324,Municipios!$B$2:$B$223,1,FALSE)","v":"Treviana"}]
["Tricio","Logroño","Tricio-hasta-Logroño",26,{"$f":"VLOOKUP(A325,Municipios!$B$2:$B$223,1,FALSE)","v":"Tricio"}]
["Tudelilla","Logroño","Tudelilla-hasta-Logroño",37,{"$f":"VLOOKUP(A326,Municipios!$B$2:$B$223,1,FALSE)","v":"Tudelilla"}]
["Uruñuela","Logroño","Uruñuela-hasta-Logroño",26,{"$f":"VLOOKUP(A327,Municipios!$B$2:$B$223,1,FALSE)","v":"Uruñuela"}]
["Valdemadera","Logroño","Valdemadera-hasta-Logroño",102,{"$f":"VLOOKUP(A328,Municipios!$B$2:$B$223,1,FALSE)","v":"Valdemadera"}]
["Valgañón","Logroño","Valgañón-hasta-Logroño",65,{"$f":"VLOOKUP(A329,Municipios!$B$2:$B$223,1,FALSE)","v":"Valgañón"}]
["Ventosa","Logroño","Ventosa-hasta-Logroño",19,{"$f":"VLOOKUP(A330,Municipios!$B$2:$B$223,1,FALSE)","v":"Ventosa"}]
["Ventrosa","Logroño","Ventrosa-hasta-Logroño",70,{"$f":"VLOOKUP(A331,Municipios!$B$2:$B$223,1,FALSE)","v":"Ventrosa"}]
["Viguera","Logroño","Viguera-hasta-Logroño",22,{"$f":"VLOOKUP(A332,Municipios!$B$2:$B$223,1,FALSE)","v":"Viguera"}]
["Villalba de Rioja","Logroño","Villalba de Rioja-hasta-Logroño",50,{"$f":"VLOOKUP(A333,Municipios!$B$2:$B$223,1,FALSE)","v":"Villalba de Rioja"}]
["Villalobar de Rioja","Logroño","Villalobar de Rioja-hasta-Logroño",52,{"$f":"VLOOKUP(A334,Municipios!$B$2:$B$223,1,FALSE)","v":"Villalobar de Rioja"}]
["Villamediana de Iregua","Logroño","Villamediana de Iregua-hasta-Logroño",6,{"$f":"VLOOKUP(A335,Municipios!$B$2:$B$223,1,FALSE)","v":"Villamediana de Iregua"}]
["Villanueva de Cameros","Logroño","Villanueva de Cameros-hasta-Logroño",42,{"$f":"VLOOKUP(A336,Municipios!$B$2:$B$223,1,FALSE)","v":"Villanueva de Cameros"}]
["Villar de Arnedo (El)","Logroño","Villar de Arnedo (El)-hasta-Logroño",36,{"$f":"VLOOKUP(A337,Municipios!$B$2:$B$223,1,FALSE)","v":"Villar de Arnedo (El)"}]
["Villar de Torre","Logroño","Villar de Torre-hasta-Logroño",43,{"$f":"VLOOKUP(A338,Municipios!$B$2:$B$223,1,FALSE)","v":"Villar de Torre"}]
["Villarejo","Logroño","Villarejo-hasta-Logroño",46,{"$f":"VLOOKUP(A339,Municipios!$B$2:$B$223,1,FALSE)","v":"Villarejo"}]
["Villarroya","Logroño","Villarroya-hasta-Logroño",63,{"$f":"VLOOKUP(A340,Municipios!$B$2:$B$223,1,FALSE)","v":"Villarroya"}]
["Villarta-Quintana","Logroño","Villarta-Quintana-hasta-Logroño",56,{"$f":"VLOOKUP(A341,Municipios!$B$2:$B$223,1,FALSE)","v":"Villarta-Quintana"}]
["Villavelayo","Logroño","Villavelayo-hasta-Logroño",79,{"$f":"VLOOKUP(A342,Municipios!$B$2:$B$223,1,FALSE)","v":"Villavelayo"}]
["Villaverde de Rioja","Logroño","Villaverde de Rioja-hasta-Logroño",43,{"$f":"VLOOKUP(A343,Municipios!$B$2:$B$223,1,FALSE)","v":"Villaverde de Rioja"}]
["Villoslada de Cameros","Logroño","Villoslada de Cameros-hasta-Logroño",50,{"$f":"VLOOKUP(A344,Municipios!$B$2:$B$223,1,FALSE)","v":"Villoslada de Cameros"}]
["Viniegra de Abajo","Logroño","Viniegra de Abajo-hasta-Logroño",68,{"$f":"VLOOKUP(A345,Municipios!$B$2:$B$223,1,FALSE)","v":"Viniegra de Abajo"}]
["Viniegra de Arriba","Logroño","Viniegra de Arriba-hasta-Logroño",78,{"$f":"VLOOKUP(A346,Municipios!$B$2:$B$223,1,FALSE)","v":"Viniegra de Arriba"}]
["Zarratón","Logroño","Zarratón-hasta-Logroño",45,{"$f":"VLOOKUP(A347,Municipios!$B$2:$B$223,1,FALSE)","v":"Zarratón"}]
["Zarzosa","Logroño","Zarzosa-hasta-Logroño",72,{"$f":"VLOOKUP(A348,Municipios!$B$2:$B$223,1,FALSE)","v":"Zarzosa"}]
["Zorraquín","Logroño","Zorraquín-hasta-Logroño",62,{"$f":"VLOOKUP(A349,Municipios!$B$2:$B$223,1,FALSE)","v":"Zorraquín"}]
["Albacete","Huesca","Albacete-hasta-Huesca",477,{"$f":"VLOOKUP(A350,Municipios!$B$2:$B$223,1,FALSE)","v":"Albacete"}]
["Albacete","Pamplona/Iruña","Albacete-hasta-Pamplona/Iruña",578,{"$f":"VLOOKUP(A351,Municipios!$B$2:$B$223,1,FALSE)","v":"Albacete"}]
["Albacete","Palencia","Albacete-hasta-Palencia",525,{"$f":"VLOOKUP(A352,Municipios!$B$2:$B$223,1,FALSE)","v":"Albacete"}]
["Albacete","Oviedo","Albacete-hasta-Oviedo",698,{"$f":"VLOOKUP(A353,Municipios!$B$2:$B$223,1,FALSE)","v":"Albacete"}]
["Albacete","Almería","Albacete-hasta-Almería",356,{"$f":"VLOOKUP(A354,Municipios!$B$2:$B$223,1,FALSE)","v":"Albacete"}]
["Albacete","Ourense","Albacete-hasta-Ourense",756,{"$f":"VLOOKUP(A355,Municipios!$B$2:$B$223,1,FALSE)","v":"Albacete"}]
["Albacete","Cádiz","Albacete-hasta-Cádiz",600,{"$f":"VLOOKUP(A356,Municipios!$B$2:$B$223,1,FALSE)","v":"Albacete"}]
["Albacete","Málaga","Albacete-hasta-Málaga",508,{"$f":"VLOOKUP(A357,Municipios!$B$2:$B$223,1,FALSE)","v":"Albacete"}]
["Albacete","Lleida","Albacete-hasta-Lleida",640,{"$f":"VLOOKUP(A358,Municipios!$B$2:$B$223,1,FALSE)","v":"Albacete"}]
["Albacete","Lugo","Albacete-hasta-Lugo",750,{"$f":"VLOOKUP(A359,Municipios!$B$2:$B$223,1,FALSE)","v":"Albacete"}]
["Albacete","Logroño","Albacete-hasta-Logroño",608,{"$f":"VLOOKUP(A360,Municipios!$B$2:$B$223,1,FALSE)","v":"Albacete"}]
["Albacete","Pontevedra","Albacete-hasta-Pontevedra",862,{"$f":"VLOOKUP(A361,Municipios!$B$2:$B$223,1,FALSE)","v":"Albacete"}]
["Albacete","Jaén","Albacete-hasta-Jaén",285,{"$f":"VLOOKUP(A362,Municipios!$B$2:$B$223,1,FALSE)","v":"Albacete"}]
["Albacete","Murcia","Albacete-hasta-Murcia",145,{"$f":"VLOOKUP(A363,Municipios!$B$2:$B$223,1,FALSE)","v":"Albacete"}]
["Albacete","Alicante/Alacant","Albacete-hasta-Alicante/Alacant",170,{"$f":"VLOOKUP(A364,Municipios!$B$2:$B$223,1,FALSE)","v":"Albacete"}]
["Albacete","Huelva","Albacete-hasta-Huelva",578,{"$f":"VLOOKUP(A365,Municipios!$B$2:$B$223,1,FALSE)","v":"Albacete"}]
["Albacete","Guadalajara","Albacete-hasta-Guadalajara",299,{"$f":"VLOOKUP(A366,Municipios!$B$2:$B$223,1,FALSE)","v":"Albacete"}]
["Albacete","Granada","Albacete-hasta-Granada",383,{"$f":"VLOOKUP(A367,Municipios!$B$2:$B$223,1,FALSE)","v":"Albacete"}]
["Albacete","Girona","Albacete-hasta-Girona",630,{"$f":"VLOOKUP(A368,Municipios!$B$2:$B$223,1,FALSE)","v":"Albacete"}]
["Albacete","Cuenca","Albacete-hasta-Cuenca",140,{"$f":"VLOOKUP(A369,Municipios!$B$2:$B$223,1,FALSE)","v":"Albacete"}]
["Albacete","Coruña (A)","Albacete-hasta-Coruña (A)",856,{"$f":"VLOOKUP(A370,Municipios!$B$2:$B$223,1,FALSE)","v":"Albacete"}]
["Albacete","Córdoba","Albacete-hasta-Córdoba",349,{"$f":"VLOOKUP(A371,Municipios!$B$2:$B$223,1,FALSE)","v":"Albacete"}]
["Albacete","Ciudad Real","Albacete-hasta-Ciudad Real",205,{"$f":"VLOOKUP(A372,Municipios!$B$2:$B$223,1,FALSE)","v":"Albacete"}]
["Albacete","Castellón de la Plana/Castelló de la Plana","Albacete-hasta-Castellón de la Plana/Castelló de la Plana",264,{"$f":"VLOOKUP(A373,Municipios!$B$2:$B$223,1,FALSE)","v":"Albacete"}]
["Albacete","León","Albacete-hasta-León",607,{"$f":"VLOOKUP(A374,Municipios!$B$2:$B$223,1,FALSE)","v":"Albacete"}]
["Albacete","Burgos","Albacete-hasta-Burgos",473,{"$f":"VLOOKUP(A375,Municipios!$B$2:$B$223,1,FALSE)","v":"Albacete"}]
["Albacete","Madrid","Albacete-hasta-Madrid",247,{"$f":"VLOOKUP(A376,Municipios!$B$2:$B$223,1,FALSE)","v":"Albacete"}]
["Albacete","Cáceres","Albacete-hasta-Cáceres",509,{"$f":"VLOOKUP(A377,Municipios!$B$2:$B$223,1,FALSE)","v":"Albacete"}]
["Albacete","Salamanca","Albacete-hasta-Salamanca",469,{"$f":"VLOOKUP(A378,Municipios!$B$2:$B$223,1,FALSE)","v":"Albacete"}]
["Albacete","Bilbao","Albacete-hasta-Bilbao",618,{"$f":"VLOOKUP(A379,Municipios!$B$2:$B$223,1,FALSE)","v":"Albacete"}]
["Albacete","Barcelona","Albacete-hasta-Barcelona",548,{"$f":"VLOOKUP(A380,Municipios!$B$2:$B$223,1,FALSE)","v":"Albacete"}]
["Albacete","Badajoz","Albacete-hasta-Badajoz",514,{"$f":"VLOOKUP(A381,Municipios!$B$2:$B$223,1,FALSE)","v":"Albacete"}]
["Albacete","Zaragoza","Albacete-hasta-Zaragoza",403,{"$f":"VLOOKUP(A382,Municipios!$B$2:$B$223,1,FALSE)","v":"Albacete"}]
["Albacete","Zamora",{"$f":"CONCATENATE(A383,\"-hasta-\",B383)","v":"Albacete-hasta-Zamora"},513,{"$f":"VLOOKUP(A383,Municipios!$B$2:$B$223,1,FALSE)","v":"Albacete"}]
["Albacete","Vitoria/Gasteiz","Albacete-hasta-Vitoria/Gasteiz",581,{"$f":"VLOOKUP(A384,Municipios!$B$2:$B$223,1,FALSE)","v":"Albacete"}]
["Albacete","Valladolid","Albacete-hasta-Valladolid",477,{"$f":"VLOOKUP(A385,Municipios!$B$2:$B$223,1,FALSE)","v":"Albacete"}]
["Albacete","Segovia","Albacete-hasta-Segovia",356,{"$f":"VLOOKUP(A386,Municipios!$B$2:$B$223,1,FALSE)","v":"Albacete"}]
["Albacete","Valencia","Albacete-hasta-Valencia",197,{"$f":"VLOOKUP(A387,Municipios!$B$2:$B$223,1,FALSE)","v":"Albacete"}]
["Albacete","Santander","Albacete-hasta-Santander",640,{"$f":"VLOOKUP(A388,Municipios!$B$2:$B$223,1,FALSE)","v":"Albacete"}]
["Albacete","Sevilla","Albacete-hasta-Sevilla",487,{"$f":"VLOOKUP(A389,Municipios!$B$2:$B$223,1,FALSE)","v":"Albacete"}]
["Albacete","Soria","Albacete-hasta-Soria",410,{"$f":"VLOOKUP(A390,Municipios!$B$2:$B$223,1,FALSE)","v":"Albacete"}]
["Albacete","Ávila","Albacete-hasta-Ávila",376,{"$f":"VLOOKUP(A391,Municipios!$B$2:$B$223,1,FALSE)","v":"Albacete"}]
["Albacete","Tarragona","Albacete-hasta-Tarragona",451,{"$f":"VLOOKUP(A392,Municipios!$B$2:$B$223,1,FALSE)","v":"Albacete"}]
["Albacete","Teruel","Albacete-hasta-Teruel",239,{"$f":"VLOOKUP(A393,Municipios!$B$2:$B$223,1,FALSE)","v":"Albacete"}]
["Albacete","Toledo","Albacete-hasta-Toledo",287,{"$f":"VLOOKUP(A394,Municipios!$B$2:$B$223,1,FALSE)","v":"Albacete"}]
["Albacete","Donostia/San Sebastián","Albacete-hasta-Donostia/San Sebastián",668,{"$f":"VLOOKUP(A395,Municipios!$B$2:$B$223,1,FALSE)","v":"Albacete"}]
["Cádiz","Oviedo","Cádiz-hasta-Oviedo",906,{"$f":"VLOOKUP(A396,Municipios!$B$2:$B$223,1,FALSE)","v":"Cádiz"}]
["Cádiz","Zaragoza","Cádiz-hasta-Zaragoza",965,{"$f":"VLOOKUP(A397,Municipios!$B$2:$B$223,1,FALSE)","v":"Cádiz"}]
["Cádiz","Segovia","Cádiz-hasta-Segovia",751,{"$f":"VLOOKUP(A398,Municipios!$B$2:$B$223,1,FALSE)","v":"Cádiz"}]
["Cádiz","Palencia","Cádiz-hasta-Palencia",749,{"$f":"VLOOKUP(A399,Municipios!$B$2:$B$223,1,FALSE)","v":"Cádiz"}]
["Cádiz","Pamplona/Iruña","Cádiz-hasta-Pamplona/Iruña",1088,{"$f":"VLOOKUP(A400,Municipios!$B$2:$B$223,1,FALSE)","v":"Cádiz"}]
["Cádiz","Pontevedra","Cádiz-hasta-Pontevedra",1032,{"$f":"VLOOKUP(A401,Municipios!$B$2:$B$223,1,FALSE)","v":"Cádiz"}]
["Cádiz","Salamanca","Cádiz-hasta-Salamanca",586,{"$f":"VLOOKUP(A402,Municipios!$B$2:$B$223,1,FALSE)","v":"Cádiz"}]
["Cádiz","Donostia/San Sebastián","Cádiz-hasta-Donostia/San Sebastián",1115,{"$f":"VLOOKUP(A403,Municipios!$B$2:$B$223,1,FALSE)","v":"Cádiz"}]
["Cádiz","Santander","Cádiz-hasta-Santander",1053,{"$f":"VLOOKUP(A404,Municipios!$B$2:$B$223,1,FALSE)","v":"Cádiz"}]
["Cádiz","Sevilla","Cádiz-hasta-Sevilla",113,{"$f":"VLOOKUP(A405,Municipios!$B$2:$B$223,1,FALSE)","v":"Cádiz"}]
["Cádiz","Soria","Cádiz-hasta-Soria",874,{"$f":"VLOOKUP(A406,Municipios!$B$2:$B$223,1,FALSE)","v":"Cádiz"}]
["Cádiz","Tarragona","Cádiz-hasta-Tarragona",1060,{"$f":"VLOOKUP(A407,Municipios!$B$2:$B$223,1,FALSE)","v":"Cádiz"}]
["Cádiz","Teruel","Cádiz-hasta-Teruel",850,{"$f":"VLOOKUP(A408,Municipios!$B$2:$B$223,1,FALSE)","v":"Cádiz"}]
["Cádiz","Valladolid","Cádiz-hasta-Valladolid",707,{"$f":"VLOOKUP(A409,Municipios!$B$2:$B$223,1,FALSE)","v":"Cádiz"}]
["Cádiz","Valencia","Cádiz-hasta-Valencia",805,{"$f":"VLOOKUP(A410,Municipios!$B$2:$B$223,1,FALSE)","v":"Cádiz"}]
["Cádiz","Zamora","Cádiz-hasta-Zamora",652,{"$f":"VLOOKUP(A411,Municipios!$B$2:$B$223,1,FALSE)","v":"Cádiz"}]
["Cádiz","Vitoria/Gasteiz","Cádiz-hasta-Vitoria/Gasteiz",998,{"$f":"VLOOKUP(A412,Municipios!$B$2:$B$223,1,FALSE)","v":"Cádiz"}]
["Cádiz","Ourense","Cádiz-hasta-Ourense",944,{"$f":"VLOOKUP(A413,Municipios!$B$2:$B$223,1,FALSE)","v":"Cádiz"}]
["Cádiz","Toledo","Cádiz-hasta-Toledo",564,{"$f":"VLOOKUP(A414,Municipios!$B$2:$B$223,1,FALSE)","v":"Cádiz"}]
["Cádiz","Córdoba","Cádiz-hasta-Córdoba",257,{"$f":"VLOOKUP(A415,Municipios!$B$2:$B$223,1,FALSE)","v":"Cádiz"}]
["Cádiz","Girona","Cádiz-hasta-Girona",1239,{"$f":"VLOOKUP(A416,Municipios!$B$2:$B$223,1,FALSE)","v":"Cádiz"}]
["Cádiz","Coruña (A)","Cádiz-hasta-Coruña (A)",1044,{"$f":"VLOOKUP(A417,Municipios!$B$2:$B$223,1,FALSE)","v":"Cádiz"}]
["Cádiz","Murcia","Cádiz-hasta-Murcia",691,{"$f":"VLOOKUP(A418,Municipios!$B$2:$B$223,1,FALSE)","v":"Cádiz"}]
["Cádiz","Ciudad Real","Cádiz-hasta-Ciudad Real",439,{"$f":"VLOOKUP(A419,Municipios!$B$2:$B$223,1,FALSE)","v":"Cádiz"}]
["Cádiz","Castellón de la Plana/Castelló de la Plana","Cádiz-hasta-Castellón de la Plana/Castelló de la Plana",872,{"$f":"VLOOKUP(A420,Municipios!$B$2:$B$223,1,FALSE)","v":"Cádiz"}]
["Cádiz","Cuenca","Cádiz-hasta-Cuenca",708,{"$f":"VLOOKUP(A421,Municipios!$B$2:$B$223,1,FALSE)","v":"Cádiz"}]
["Cádiz","Granada","Cádiz-hasta-Granada",407,{"$f":"VLOOKUP(A422,Municipios!$B$2:$B$223,1,FALSE)","v":"Cádiz"}]
["Cádiz","Guadalajara","Cádiz-hasta-Guadalajara",705,{"$f":"VLOOKUP(A423,Municipios!$B$2:$B$223,1,FALSE)","v":"Cádiz"}]
["Cádiz","Lleida","Cádiz-hasta-Lleida",1137,{"$f":"VLOOKUP(A424,Municipios!$B$2:$B$223,1,FALSE)","v":"Cádiz"}]
["Cádiz","Huelva","Cádiz-hasta-Huelva",199,{"$f":"VLOOKUP(A425,Municipios!$B$2:$B$223,1,FALSE)","v":"Cádiz"}]
["Cádiz","Madrid","Cádiz-hasta-Madrid",648,{"$f":"VLOOKUP(A426,Municipios!$B$2:$B$223,1,FALSE)","v":"Cádiz"}]
["Cádiz","Lugo","Cádiz-hasta-Lugo",952,{"$f":"VLOOKUP(A427,Municipios!$B$2:$B$223,1,FALSE)","v":"Cádiz"}]
["Cádiz","Logroño","Cádiz-hasta-Logroño",1033,{"$f":"VLOOKUP(A428,Municipios!$B$2:$B$223,1,FALSE)","v":"Cádiz"}]
["Cádiz","León","Cádiz-hasta-León",788,{"$f":"VLOOKUP(A429,Municipios!$B$2:$B$223,1,FALSE)","v":"Cádiz"}]
["Cádiz","Jaén","Cádiz-hasta-Jaén",391,{"$f":"VLOOKUP(A430,Municipios!$B$2:$B$223,1,FALSE)","v":"Cádiz"}]
["Cádiz","Huesca","Cádiz-hasta-Huesca",1036,{"$f":"VLOOKUP(A431,Municipios!$B$2:$B$223,1,FALSE)","v":"Cádiz"}]
["Cádiz","Málaga","Cádiz-hasta-Málaga",265,{"$f":"VLOOKUP(A432,Municipios!$B$2:$B$223,1,FALSE)","v":"Cádiz"}]
["Castellón de la Plana/Castelló de la Plana","Pamplona/Iruña","Castellón de la Plana/Castelló de la Plana-hasta-Pamplona/Iruña",519,{"$f":"VLOOKUP(A433,Municipios!$B$2:$B$223,1,FALSE)","v":"Castellón de la Plana/Castelló de la Plana"}]
["Castellón de la Plana/Castelló de la Plana","Palencia","Castellón de la Plana/Castelló de la Plana-hasta-Palencia",607,{"$f":"VLOOKUP(A434,Municipios!$B$2:$B$223,1,FALSE)","v":"Castellón de la Plana/Castelló de la Plana"}]
["Castellón de la Plana/Castelló de la Plana","Valladolid","Castellón de la Plana/Castelló de la Plana-hasta-Valladolid",649,{"$f":"VLOOKUP(A435,Municipios!$B$2:$B$223,1,FALSE)","v":"Castellón de la Plana/Castelló de la Plana"}]
["Castellón de la Plana/Castelló de la Plana","Sevilla","Castellón de la Plana/Castelló de la Plana-hasta-Sevilla",753,{"$f":"VLOOKUP(A436,Municipios!$B$2:$B$223,1,FALSE)","v":"Castellón de la Plana/Castelló de la Plana"}]
["Castellón de la Plana/Castelló de la Plana","Pontevedra","Castellón de la Plana/Castelló de la Plana-hasta-Pontevedra",1034,{"$f":"VLOOKUP(A437,Municipios!$B$2:$B$223,1,FALSE)","v":"Castellón de la Plana/Castelló de la Plana"}]
["Castellón de la Plana/Castelló de la Plana","Salamanca","Castellón de la Plana/Castelló de la Plana-hasta-Salamanca",650,{"$f":"VLOOKUP(A438,Municipios!$B$2:$B$223,1,FALSE)","v":"Castellón de la Plana/Castelló de la Plana"}]
["Castellón de la Plana/Castelló de la Plana","Donostia/San Sebastián","Castellón de la Plana/Castelló de la Plana-hasta-Donostia/San Sebastián",609,{"$f":"VLOOKUP(A439,Municipios!$B$2:$B$223,1,FALSE)","v":"Castellón de la Plana/Castelló de la Plana"}]
["Castellón de la Plana/Castelló de la Plana","Santander","Castellón de la Plana/Castelló de la Plana-hasta-Santander",738,{"$f":"VLOOKUP(A440,Municipios!$B$2:$B$223,1,FALSE)","v":"Castellón de la Plana/Castelló de la Plana"}]
["Castellón de la Plana/Castelló de la Plana","Segovia","Castellón de la Plana/Castelló de la Plana-hasta-Segovia",537,{"$f":"VLOOKUP(A441,Municipios!$B$2:$B$223,1,FALSE)","v":"Castellón de la Plana/Castelló de la Plana"}]
["Castellón de la Plana/Castelló de la Plana","Soria","Castellón de la Plana/Castelló de la Plana-hasta-Soria",385,{"$f":"VLOOKUP(A442,Municipios!$B$2:$B$223,1,FALSE)","v":"Castellón de la Plana/Castelló de la Plana"}]
["Castellón de la Plana/Castelló de la Plana","Tarragona","Castellón de la Plana/Castelló de la Plana-hasta-Tarragona",178,{"$f":"VLOOKUP(A443,Municipios!$B$2:$B$223,1,FALSE)","v":"Castellón de la Plana/Castelló de la Plana"}]
["Castellón de la Plana/Castelló de la Plana","Teruel","Castellón de la Plana/Castelló de la Plana-hasta-Teruel",163,{"$f":"VLOOKUP(A444,Municipios!$B$2:$B$223,1,FALSE)","v":"Castellón de la Plana/Castelló de la Plana"}]
["Castellón de la Plana/Castelló de la Plana","Zaragoza","Castellón de la Plana/Castelló de la Plana-hasta-Zaragoza",344,{"$f":"VLOOKUP(A445,Municipios!$B$2:$B$223,1,FALSE)","v":"Castellón de la Plana/Castelló de la Plana"}]
["Castellón de la Plana/Castelló de la Plana","Valencia","Castellón de la Plana/Castelló de la Plana-hasta-Valencia",67,{"$f":"VLOOKUP(A446,Municipios!$B$2:$B$223,1,FALSE)","v":"Castellón de la Plana/Castelló de la Plana"}]
["Castellón de la Plana/Castelló de la Plana","Vitoria/Gasteiz",{"$f":"CONCATENATE(A447,\"-hasta-\",B447)","v":"Castellón de la Plana/Castelló de la Plana-hasta-Vitoria/Gasteiz"},604,{"$f":"VLOOKUP(A447,Municipios!$B$2:$B$223,1,FALSE)","v":"Castellón de la Plana/Castelló de la Plana"}]
["Castellón de la Plana/Castelló de la Plana","Zamora","Castellón de la Plana/Castelló de la Plana-hasta-Zamora",696,{"$f":"VLOOKUP(A448,Municipios!$B$2:$B$223,1,FALSE)","v":"Castellón de la Plana/Castelló de la Plana"}]
["Castellón de la Plana/Castelló de la Plana","Huesca","Castellón de la Plana/Castelló de la Plana-hasta-Huesca",418,{"$f":"VLOOKUP(A449,Municipios!$B$2:$B$223,1,FALSE)","v":"Castellón de la Plana/Castelló de la Plana"}]
["Castellón de la Plana/Castelló de la Plana","Oviedo","Castellón de la Plana/Castelló de la Plana-hasta-Oviedo",880,{"$f":"VLOOKUP(A450,Municipios!$B$2:$B$223,1,FALSE)","v":"Castellón de la Plana/Castelló de la Plana"}]
["Castellón de la Plana/Castelló de la Plana","Toledo","Castellón de la Plana/Castelló de la Plana-hasta-Toledo",429,{"$f":"VLOOKUP(A451,Municipios!$B$2:$B$223,1,FALSE)","v":"Castellón de la Plana/Castelló de la Plana"}]
["Castellón de la Plana/Castelló de la Plana","Córdoba","Castellón de la Plana/Castelló de la Plana-hasta-Córdoba",615,{"$f":"VLOOKUP(A452,Municipios!$B$2:$B$223,1,FALSE)","v":"Castellón de la Plana/Castelló de la Plana"}]
["Castellón de la Plana/Castelló de la Plana","Ourense","Castellón de la Plana/Castelló de la Plana-hasta-Ourense",928,{"$f":"VLOOKUP(A453,Municipios!$B$2:$B$223,1,FALSE)","v":"Castellón de la Plana/Castelló de la Plana"}]
["Castellón de la Plana/Castelló de la Plana","León","Castellón de la Plana/Castelló de la Plana-hasta-León",782,{"$f":"VLOOKUP(A454,Municipios!$B$2:$B$223,1,FALSE)","v":"Castellón de la Plana/Castelló de la Plana"}]
["Castellón de la Plana/Castelló de la Plana","Ciudad Real","Castellón de la Plana/Castelló de la Plana-hasta-Ciudad Real",372,{"$f":"VLOOKUP(A455,Municipios!$B$2:$B$223,1,FALSE)","v":"Castellón de la Plana/Castelló de la Plana"}]
["Castellón de la Plana/Castelló de la Plana","Coruña (A)","Castellón de la Plana/Castelló de la Plana-hasta-Coruña (A)",1028,{"$f":"VLOOKUP(A456,Municipios!$B$2:$B$223,1,FALSE)","v":"Castellón de la Plana/Castelló de la Plana"}]
["Castellón de la Plana/Castelló de la Plana","Cuenca","Castellón de la Plana/Castelló de la Plana-hasta-Cuenca",308,{"$f":"VLOOKUP(A457,Municipios!$B$2:$B$223,1,FALSE)","v":"Castellón de la Plana/Castelló de la Plana"}]
["Castellón de la Plana/Castelló de la Plana","Girona","Castellón de la Plana/Castelló de la Plana-hasta-Girona",359,{"$f":"VLOOKUP(A458,Municipios!$B$2:$B$223,1,FALSE)","v":"Castellón de la Plana/Castelló de la Plana"}]
["Castellón de la Plana/Castelló de la Plana","Granada","Castellón de la Plana/Castelló de la Plana-hasta-Granada",669,{"$f":"VLOOKUP(A459,Municipios!$B$2:$B$223,1,FALSE)","v":"Castellón de la Plana/Castelló de la Plana"}]
["Castellón de la Plana/Castelló de la Plana","Guadalajara","Castellón de la Plana/Castelló de la Plana-hasta-Guadalajara",414,{"$f":"VLOOKUP(A460,Municipios!$B$2:$B$223,1,FALSE)","v":"Castellón de la Plana/Castelló de la Plana"}]
["Castellón de la Plana/Castelló de la Plana","Huelva","Castellón de la Plana/Castelló de la Plana-hasta-Huelva",844,{"$f":"VLOOKUP(A461,Municipios!$B$2:$B$223,1,FALSE)","v":"Castellón de la Plana/Castelló de la Plana"}]
["Castellón de la Plana/Castelló de la Plana","Jaén","Castellón de la Plana/Castelló de la Plana-hasta-Jaén",551,{"$f":"VLOOKUP(A462,Municipios!$B$2:$B$223,1,FALSE)","v":"Castellón de la Plana/Castelló de la Plana"}]
["Castellón de la Plana/Castelló de la Plana","Logroño","Castellón de la Plana/Castelló de la Plana-hasta-Logroño",588,{"$f":"VLOOKUP(A463,Municipios!$B$2:$B$223,1,FALSE)","v":"Castellón de la Plana/Castelló de la Plana"}]
["Castellón de la Plana/Castelló de la Plana","Lugo","Castellón de la Plana/Castelló de la Plana-hasta-Lugo",940,{"$f":"VLOOKUP(A464,Municipios!$B$2:$B$223,1,FALSE)","v":"Castellón de la Plana/Castelló de la Plana"}]
["Castellón de la Plana/Castelló de la Plana","Lleida","Castellón de la Plana/Castelló de la Plana-hasta-Lleida",312,{"$f":"VLOOKUP(A465,Municipios!$B$2:$B$223,1,FALSE)","v":"Castellón de la Plana/Castelló de la Plana"}]
["Castellón de la Plana/Castelló de la Plana","Madrid","Castellón de la Plana/Castelló de la Plana-hasta-Madrid",419,{"$f":"VLOOKUP(A466,Municipios!$B$2:$B$223,1,FALSE)","v":"Castellón de la Plana/Castelló de la Plana"}]
["Castellón de la Plana/Castelló de la Plana","Murcia","Castellón de la Plana/Castelló de la Plana-hasta-Murcia",331,{"$f":"VLOOKUP(A467,Municipios!$B$2:$B$223,1,FALSE)","v":"Castellón de la Plana/Castelló de la Plana"}]
["Castellón de la Plana/Castelló de la Plana","Málaga","Castellón de la Plana/Castelló de la Plana-hasta-Málaga",734,{"$f":"VLOOKUP(A468,Municipios!$B$2:$B$223,1,FALSE)","v":"Castellón de la Plana/Castelló de la Plana"}]
["Ciudad Real","Toledo","Ciudad Real-hasta-Toledo",117,{"$f":"VLOOKUP(A469,Municipios!$B$2:$B$223,1,FALSE)","v":"Ciudad Real"}]
["Ciudad Real","Palencia","Ciudad Real-hasta-Palencia",454,{"$f":"VLOOKUP(A470,Municipios!$B$2:$B$223,1,FALSE)","v":"Ciudad Real"}]
["Ciudad Real","Pamplona/Iruña","Ciudad Real-hasta-Pamplona/Iruña",608,{"$f":"VLOOKUP(A471,Municipios!$B$2:$B$223,1,FALSE)","v":"Ciudad Real"}]
["Ciudad Real","Pontevedra","Ciudad Real-hasta-Pontevedra",779,{"$f":"VLOOKUP(A472,Municipios!$B$2:$B$223,1,FALSE)","v":"Ciudad Real"}]
["Ciudad Real","Salamanca","Ciudad Real-hasta-Salamanca",399,{"$f":"VLOOKUP(A473,Municipios!$B$2:$B$223,1,FALSE)","v":"Ciudad Real"}]
["Ciudad Real","Donostia/San Sebastián","Ciudad Real-hasta-Donostia/San Sebastián",653,{"$f":"VLOOKUP(A474,Municipios!$B$2:$B$223,1,FALSE)","v":"Ciudad Real"}]
["Ciudad Real","Segovia","Ciudad Real-hasta-Segovia",285,{"$f":"VLOOKUP(A475,Municipios!$B$2:$B$223,1,FALSE)","v":"Ciudad Real"}]
["Ciudad Real","Soria","Ciudad Real-hasta-Soria",414,{"$f":"VLOOKUP(A476,Municipios!$B$2:$B$223,1,FALSE)","v":"Ciudad Real"}]
["Ciudad Real","Vitoria/Gasteiz","Ciudad Real-hasta-Vitoria/Gasteiz",536,{"$f":"VLOOKUP(A477,Municipios!$B$2:$B$223,1,FALSE)","v":"Ciudad Real"}]
["Ciudad Real","Teruel","Ciudad Real-hasta-Teruel",343,{"$f":"VLOOKUP(A478,Municipios!$B$2:$B$223,1,FALSE)","v":"Ciudad Real"}]
["Ciudad Real","Zamora","Ciudad Real-hasta-Zamora",444,{"$f":"VLOOKUP(A479,Municipios!$B$2:$B$223,1,FALSE)","v":"Ciudad Real"}]
["Ciudad Real","Valencia","Ciudad Real-hasta-Valencia",316,{"$f":"VLOOKUP(A480,Municipios!$B$2:$B$223,1,FALSE)","v":"Ciudad Real"}]
["Ciudad Real","Valladolid","Ciudad Real-hasta-Valladolid",405,{"$f":"VLOOKUP(A481,Municipios!$B$2:$B$223,1,FALSE)","v":"Ciudad Real"}]
["Ciudad Real","Oviedo","Ciudad Real-hasta-Oviedo",629,{"$f":"VLOOKUP(A482,Municipios!$B$2:$B$223,1,FALSE)","v":"Ciudad Real"}]
["Ciudad Real","Santander","Ciudad Real-hasta-Santander",590,{"$f":"VLOOKUP(A483,Municipios!$B$2:$B$223,1,FALSE)","v":"Ciudad Real"}]
["Ciudad Real","Zaragoza","Ciudad Real-hasta-Zaragoza",505,{"$f":"VLOOKUP(A484,Municipios!$B$2:$B$223,1,FALSE)","v":"Ciudad Real"}]
["Ciudad Real","Tarragona","Ciudad Real-hasta-Tarragona",582,{"$f":"VLOOKUP(A485,Municipios!$B$2:$B$223,1,FALSE)","v":"Ciudad Real"}]
["Ciudad Real","Guadalajara","Ciudad Real-hasta-Guadalajara",246,{"$f":"VLOOKUP(A486,Municipios!$B$2:$B$223,1,FALSE)","v":"Ciudad Real"}]
["Ciudad Real","Sevilla","Ciudad Real-hasta-Sevilla",320,{"$f":"VLOOKUP(A487,Municipios!$B$2:$B$223,1,FALSE)","v":"Ciudad Real"}]
["Ciudad Real","Coruña (A)","Ciudad Real-hasta-Coruña (A)",785,{"$f":"VLOOKUP(A488,Municipios!$B$2:$B$223,1,FALSE)","v":"Ciudad Real"}]
["Ciudad Real","Cuenca","Ciudad Real-hasta-Cuenca",195,{"$f":"VLOOKUP(A489,Municipios!$B$2:$B$223,1,FALSE)","v":"Ciudad Real"}]
["Ciudad Real","Ourense","Ciudad Real-hasta-Ourense",685,{"$f":"VLOOKUP(A490,Municipios!$B$2:$B$223,1,FALSE)","v":"Ciudad Real"}]
["Ciudad Real","Granada","Ciudad Real-hasta-Granada",295,{"$f":"VLOOKUP(A491,Municipios!$B$2:$B$223,1,FALSE)","v":"Ciudad Real"}]
["Ciudad Real","Córdoba","Ciudad Real-hasta-Córdoba",183,{"$f":"VLOOKUP(A492,Municipios!$B$2:$B$223,1,FALSE)","v":"Ciudad Real"}]
["Ciudad Real","Huelva","Ciudad Real-hasta-Huelva",411,{"$f":"VLOOKUP(A493,Municipios!$B$2:$B$223,1,FALSE)","v":"Ciudad Real"}]
["Ciudad Real","Huesca","Ciudad Real-hasta-Huesca",576,{"$f":"VLOOKUP(A494,Municipios!$B$2:$B$223,1,FALSE)","v":"Ciudad Real"}]
["Ciudad Real","León","Ciudad Real-hasta-León",531,{"$f":"VLOOKUP(A495,Municipios!$B$2:$B$223,1,FALSE)","v":"Ciudad Real"}]
["Ciudad Real","Logroño","Ciudad Real-hasta-Logroño",571,{"$f":"VLOOKUP(A496,Municipios!$B$2:$B$223,1,FALSE)","v":"Ciudad Real"}]
["Ciudad Real","Lugo","Ciudad Real-hasta-Lugo",697,{"$f":"VLOOKUP(A497,Municipios!$B$2:$B$223,1,FALSE)","v":"Ciudad Real"}]
["Ciudad Real","Lleida","Ciudad Real-hasta-Lleida",666,{"$f":"VLOOKUP(A498,Municipios!$B$2:$B$223,1,FALSE)","v":"Ciudad Real"}]
["Ciudad Real","Madrid","Ciudad Real-hasta-Madrid",184,{"$f":"VLOOKUP(A499,Municipios!$B$2:$B$223,1,FALSE)","v":"Ciudad Real"}]
["Ciudad Real","Málaga","Ciudad Real-hasta-Málaga",342,{"$f":"VLOOKUP(A500,Municipios!$B$2:$B$223,1,FALSE)","v":"Ciudad Real"}]
["Ciudad Real","Jaén","Ciudad Real-hasta-Jaén",213,{"$f":"VLOOKUP(A501,Municipios!$B$2:$B$223,1,FALSE)","v":"Ciudad Real"}]
["Ciudad Real","Girona","Ciudad Real-hasta-Girona",761,{"$f":"VLOOKUP(A502,Municipios!$B$2:$B$223,1,FALSE)","v":"Ciudad Real"}]
["Ciudad Real","Murcia","Ciudad Real-hasta-Murcia",352,{"$f":"VLOOKUP(A503,Municipios!$B$2:$B$223,1,FALSE)","v":"Ciudad Real"}]
["Córdoba","Palencia","Córdoba-hasta-Palencia",661,{"$f":"VLOOKUP(A504,Municipios!$B$2:$B$223,1,FALSE)","v":"Córdoba"}]
["Córdoba","Segovia","Córdoba-hasta-Segovia",494,{"$f":"VLOOKUP(A505,Municipios!$B$2:$B$223,1,FALSE)","v":"Córdoba"}]
["Córdoba","Santander","Córdoba-hasta-Santander",795,{"$f":"VLOOKUP(A506,Municipios!$B$2:$B$223,1,FALSE)","v":"Córdoba"}]
["Córdoba","Donostia/San Sebastián","Córdoba-hasta-Donostia/San Sebastián",858,{"$f":"VLOOKUP(A507,Municipios!$B$2:$B$223,1,FALSE)","v":"Córdoba"}]
["Córdoba","Salamanca","Córdoba-hasta-Salamanca",535,{"$f":"VLOOKUP(A508,Municipios!$B$2:$B$223,1,FALSE)","v":"Córdoba"}]
["Córdoba","Pamplona/Iruña","Córdoba-hasta-Pamplona/Iruña",815,{"$f":"VLOOKUP(A509,Municipios!$B$2:$B$223,1,FALSE)","v":"Córdoba"}]
["Córdoba","Pontevedra","Córdoba-hasta-Pontevedra",998,{"$f":"VLOOKUP(A510,Municipios!$B$2:$B$223,1,FALSE)","v":"Córdoba"}]
["Córdoba","Sevilla",{"$f":"CONCATENATE(A511,\"-hasta-\",B511)","v":"Córdoba-hasta-Sevilla"},138,{"$f":"VLOOKUP(A511,Municipios!$B$2:$B$223,1,FALSE)","v":"Córdoba"}]
["Córdoba","Soria","Córdoba-hasta-Soria",618,{"$f":"VLOOKUP(A512,Municipios!$B$2:$B$223,1,FALSE)","v":"Córdoba"}]
["Córdoba","Tarragona","Córdoba-hasta-Tarragona",803,{"$f":"VLOOKUP(A513,Municipios!$B$2:$B$223,1,FALSE)","v":"Córdoba"}]
["Córdoba","Teruel","Córdoba-hasta-Teruel",593,{"$f":"VLOOKUP(A514,Municipios!$B$2:$B$223,1,FALSE)","v":"Córdoba"}]
["Córdoba","Toledo","Córdoba-hasta-Toledo",307,{"$f":"VLOOKUP(A515,Municipios!$B$2:$B$223,1,FALSE)","v":"Córdoba"}]
["Córdoba","Oviedo","Córdoba-hasta-Oviedo",837,{"$f":"VLOOKUP(A516,Municipios!$B$2:$B$223,1,FALSE)","v":"Córdoba"}]
["Córdoba","Vitoria/Gasteiz","Córdoba-hasta-Vitoria/Gasteiz",741,{"$f":"VLOOKUP(A517,Municipios!$B$2:$B$223,1,FALSE)","v":"Córdoba"}]
["Córdoba","Huelva","Córdoba-hasta-Huelva",229,{"$f":"VLOOKUP(A518,Municipios!$B$2:$B$223,1,FALSE)","v":"Córdoba"}]
["Córdoba","Valencia","Córdoba-hasta-Valencia",548,{"$f":"VLOOKUP(A519,Municipios!$B$2:$B$223,1,FALSE)","v":"Córdoba"}]
["Córdoba","León","Córdoba-hasta-León",739,{"$f":"VLOOKUP(A520,Municipios!$B$2:$B$223,1,FALSE)","v":"Córdoba"}]
["Córdoba","Zamora","Córdoba-hasta-Zamora",600,{"$f":"VLOOKUP(A521,Municipios!$B$2:$B$223,1,FALSE)","v":"Córdoba"}]
["Córdoba","Zaragoza","Córdoba-hasta-Zaragoza",709,{"$f":"VLOOKUP(A522,Municipios!$B$2:$B$223,1,FALSE)","v":"Córdoba"}]
["Córdoba","Coruña (A)","Córdoba-hasta-Coruña (A)",995,{"$f":"VLOOKUP(A523,Municipios!$B$2:$B$223,1,FALSE)","v":"Córdoba"}]
["Córdoba","Cuenca","Córdoba-hasta-Cuenca",451,{"$f":"VLOOKUP(A524,Municipios!$B$2:$B$223,1,FALSE)","v":"Córdoba"}]
["Córdoba","Girona","Córdoba-hasta-Girona",982,{"$f":"VLOOKUP(A525,Municipios!$B$2:$B$223,1,FALSE)","v":"Córdoba"}]
["Córdoba","Granada","Córdoba-hasta-Granada",231,{"$f":"VLOOKUP(A526,Municipios!$B$2:$B$223,1,FALSE)","v":"Córdoba"}]
["Córdoba","Jaén","Córdoba-hasta-Jaén",104,{"$f":"VLOOKUP(A527,Municipios!$B$2:$B$223,1,FALSE)","v":"Córdoba"}]
["Córdoba","Huesca","Córdoba-hasta-Huesca",779,{"$f":"VLOOKUP(A528,Municipios!$B$2:$B$223,1,FALSE)","v":"Córdoba"}]
["Córdoba","Ourense","Córdoba-hasta-Ourense",893,{"$f":"VLOOKUP(A529,Municipios!$B$2:$B$223,1,FALSE)","v":"Córdoba"}]
["Córdoba","Logroño","Córdoba-hasta-Logroño",776,{"$f":"VLOOKUP(A530,Municipios!$B$2:$B$223,1,FALSE)","v":"Córdoba"}]
["Córdoba","Lugo","Córdoba-hasta-Lugo",907,{"$f":"VLOOKUP(A531,Municipios!$B$2:$B$223,1,FALSE)","v":"Córdoba"}]
["Córdoba","Lleida","Córdoba-hasta-Lleida",869,{"$f":"VLOOKUP(A532,Municipios!$B$2:$B$223,1,FALSE)","v":"Córdoba"}]
["Córdoba","Madrid","Córdoba-hasta-Madrid",391,{"$f":"VLOOKUP(A533,Municipios!$B$2:$B$223,1,FALSE)","v":"Córdoba"}]
["Córdoba","Málaga","Córdoba-hasta-Málaga",159,{"$f":"VLOOKUP(A534,Municipios!$B$2:$B$223,1,FALSE)","v":"Córdoba"}]
["Córdoba","Murcia","Córdoba-hasta-Murcia",496,{"$f":"VLOOKUP(A535,Municipios!$B$2:$B$223,1,FALSE)","v":"Córdoba"}]
["Córdoba","Guadalajara","Córdoba-hasta-Guadalajara",448,{"$f":"VLOOKUP(A536,Municipios!$B$2:$B$223,1,FALSE)","v":"Córdoba"}]
["Córdoba","Valladolid","Córdoba-hasta-Valladolid",613,{"$f":"VLOOKUP(A537,Municipios!$B$2:$B$223,1,FALSE)","v":"Córdoba"}]
["Coruña (A)","Lleida","Coruña (A)-hasta-Lleida",991,{"$f":"VLOOKUP(A538,Municipios!$B$2:$B$223,1,FALSE)","v":"Coruña (A)"}]
["Coruña (A)","Donostia/San Sebastián","Coruña (A)-hasta-Donostia/San Sebastián",699,{"$f":"VLOOKUP(A539,Municipios!$B$2:$B$223,1,FALSE)","v":"Coruña (A)"}]
["Coruña (A)","Salamanca","Coruña (A)-hasta-Salamanca",461,{"$f":"VLOOKUP(A540,Municipios!$B$2:$B$223,1,FALSE)","v":"Coruña (A)"}]
["Coruña (A)","Pontevedra","Coruña (A)-hasta-Pontevedra",132,{"$f":"VLOOKUP(A541,Municipios!$B$2:$B$223,1,FALSE)","v":"Coruña (A)"}]
["Coruña (A)","Pamplona/Iruña","Coruña (A)-hasta-Pamplona/Iruña",789,{"$f":"VLOOKUP(A542,Municipios!$B$2:$B$223,1,FALSE)","v":"Coruña (A)"}]
["Coruña (A)","Palencia","Coruña (A)-hasta-Palencia",434,{"$f":"VLOOKUP(A543,Municipios!$B$2:$B$223,1,FALSE)","v":"Coruña (A)"}]
["Coruña (A)","Oviedo","Coruña (A)-hasta-Oviedo",301,{"$f":"VLOOKUP(A544,Municipios!$B$2:$B$223,1,FALSE)","v":"Coruña (A)"}]
["Coruña (A)","Ourense","Coruña (A)-hasta-Ourense",238,{"$f":"VLOOKUP(A545,Municipios!$B$2:$B$223,1,FALSE)","v":"Coruña (A)"}]
["Coruña (A)","Murcia","Coruña (A)-hasta-Murcia",997,{"$f":"VLOOKUP(A546,Municipios!$B$2:$B$223,1,FALSE)","v":"Coruña (A)"}]
["Coruña (A)","Santander","Coruña (A)-hasta-Santander",494,{"$f":"VLOOKUP(A547,Municipios!$B$2:$B$223,1,FALSE)","v":"Coruña (A)"}]
["Coruña (A)","Madrid","Coruña (A)-hasta-Madrid",590,{"$f":"VLOOKUP(A548,Municipios!$B$2:$B$223,1,FALSE)","v":"Coruña (A)"}]
["Coruña (A)","Huelva","Coruña (A)-hasta-Huelva",1016,{"$f":"VLOOKUP(A549,Municipios!$B$2:$B$223,1,FALSE)","v":"Coruña (A)"}]
["Coruña (A)","Lugo","Coruña (A)-hasta-Lugo",88,{"$f":"VLOOKUP(A550,Municipios!$B$2:$B$223,1,FALSE)","v":"Coruña (A)"}]
["Coruña (A)","Logroño","Coruña (A)-hasta-Logroño",641,{"$f":"VLOOKUP(A551,Municipios!$B$2:$B$223,1,FALSE)","v":"Coruña (A)"}]
["Coruña (A)","León","Coruña (A)-hasta-León",308,{"$f":"VLOOKUP(A552,Municipios!$B$2:$B$223,1,FALSE)","v":"Coruña (A)"}]
["Coruña (A)","Jaén","Coruña (A)-hasta-Jaén",928,{"$f":"VLOOKUP(A553,Municipios!$B$2:$B$223,1,FALSE)","v":"Coruña (A)"}]
["Coruña (A)","Huesca","Coruña (A)-hasta-Huesca",887,{"$f":"VLOOKUP(A554,Municipios!$B$2:$B$223,1,FALSE)","v":"Coruña (A)"}]
["Coruña (A)","Guadalajara","Coruña (A)-hasta-Guadalajara",649,{"$f":"VLOOKUP(A555,Municipios!$B$2:$B$223,1,FALSE)","v":"Coruña (A)"}]
["Coruña (A)","Girona","Coruña (A)-hasta-Girona",1195,{"$f":"VLOOKUP(A556,Municipios!$B$2:$B$223,1,FALSE)","v":"Coruña (A)"}]
["Coruña (A)","Cuenca","Coruña (A)-hasta-Cuenca",779,{"$f":"VLOOKUP(A557,Municipios!$B$2:$B$223,1,FALSE)","v":"Coruña (A)"}]
["Coruña (A)","Málaga","Coruña (A)-hasta-Málaga",1130,{"$f":"VLOOKUP(A558,Municipios!$B$2:$B$223,1,FALSE)","v":"Coruña (A)"}]
["Coruña (A)","Vitoria/Gasteiz","Coruña (A)-hasta-Vitoria/Gasteiz",718,{"$f":"VLOOKUP(A559,Municipios!$B$2:$B$223,1,FALSE)","v":"Coruña (A)"}]
["Coruña (A)","Segovia","Coruña (A)-hasta-Segovia",546,{"$f":"VLOOKUP(A560,Municipios!$B$2:$B$223,1,FALSE)","v":"Coruña (A)"}]
["Coruña (A)","Granada","Coruña (A)-hasta-Granada",1019,{"$f":"VLOOKUP(A561,Municipios!$B$2:$B$223,1,FALSE)","v":"Coruña (A)"}]
["Coruña (A)","Zamora","Coruña (A)-hasta-Zamora",392,{"$f":"VLOOKUP(A562,Municipios!$B$2:$B$223,1,FALSE)","v":"Coruña (A)"}]
["Coruña (A)","Valladolid","Coruña (A)-hasta-Valladolid",442,{"$f":"VLOOKUP(A563,Municipios!$B$2:$B$223,1,FALSE)","v":"Coruña (A)"}]
["Coruña (A)","Valencia","Coruña (A)-hasta-Valencia",956,{"$f":"VLOOKUP(A564,Municipios!$B$2:$B$223,1,FALSE)","v":"Coruña (A)"}]
["Coruña (A)","Toledo","Coruña (A)-hasta-Toledo",666,{"$f":"VLOOKUP(A565,Municipios!$B$2:$B$223,1,FALSE)","v":"Coruña (A)"}]
["Coruña (A)","Teruel","Coruña (A)-hasta-Teruel",924,{"$f":"VLOOKUP(A566,Municipios!$B$2:$B$223,1,FALSE)","v":"Coruña (A)"}]
["Coruña (A)","Tarragona","Coruña (A)-hasta-Tarragona",1079,{"$f":"VLOOKUP(A567,Municipios!$B$2:$B$223,1,FALSE)","v":"Coruña (A)"}]
["Coruña (A)","Soria","Coruña (A)-hasta-Soria",659,{"$f":"VLOOKUP(A568,Municipios!$B$2:$B$223,1,FALSE)","v":"Coruña (A)"}]
["Coruña (A)","Sevilla","Coruña (A)-hasta-Sevilla",930,{"$f":"VLOOKUP(A569,Municipios!$B$2:$B$223,1,FALSE)","v":"Coruña (A)"}]
["Coruña (A)","Zaragoza","Coruña (A)-hasta-Zaragoza",812,{"$f":"VLOOKUP(A570,Municipios!$B$2:$B$223,1,FALSE)","v":"Coruña (A)"}]
["Cuenca","Zamora","Cuenca-hasta-Zamora",439,{"$f":"VLOOKUP(A571,Municipios!$B$2:$B$223,1,FALSE)","v":"Cuenca"}]
["Cuenca","Soria","Cuenca-hasta-Soria",269,{"$f":"VLOOKUP(A572,Municipios!$B$2:$B$223,1,FALSE)","v":"Cuenca"}]
["Cuenca","Pontevedra","Cuenca-hasta-Pontevedra",774,{"$f":"VLOOKUP(A573,Municipios!$B$2:$B$223,1,FALSE)","v":"Cuenca"}]
["Cuenca","Donostia/San Sebastián","Cuenca-hasta-Donostia/San Sebastián",543,{"$f":"VLOOKUP(A574,Municipios!$B$2:$B$223,1,FALSE)","v":"Cuenca"}]
["Cuenca","Santander",{"$f":"CONCATENATE(A575,\"-hasta-\",B575)","v":"Cuenca-hasta-Santander"},564,{"$f":"VLOOKUP(A575,Municipios!$B$2:$B$223,1,FALSE)","v":"Cuenca"}]
["Cuenca","Segovia","Cuenca-hasta-Segovia",280,{"$f":"VLOOKUP(A576,Municipios!$B$2:$B$223,1,FALSE)","v":"Cuenca"}]
["Cuenca","Sevilla","Cuenca-hasta-Sevilla",588,{"$f":"VLOOKUP(A577,Municipios!$B$2:$B$223,1,FALSE)","v":"Cuenca"}]
["Cuenca","Tarragona","Cuenca-hasta-Tarragona",446,{"$f":"VLOOKUP(A578,Municipios!$B$2:$B$223,1,FALSE)","v":"Cuenca"}]
["Cuenca","Teruel","Cuenca-hasta-Teruel",147,{"$f":"VLOOKUP(A579,Municipios!$B$2:$B$223,1,FALSE)","v":"Cuenca"}]
["Cuenca","Toledo","Cuenca-hasta-Toledo",177,{"$f":"VLOOKUP(A580,Municipios!$B$2:$B$223,1,FALSE)","v":"Cuenca"}]
["Cuenca","Valencia","Cuenca-hasta-Valencia",180,{"$f":"VLOOKUP(A581,Municipios!$B$2:$B$223,1,FALSE)","v":"Cuenca"}]
["Cuenca","Vitoria/Gasteiz","Cuenca-hasta-Vitoria/Gasteiz",467,{"$f":"VLOOKUP(A582,Municipios!$B$2:$B$223,1,FALSE)","v":"Cuenca"}]
["Cuenca","Pamplona/Iruña","Cuenca-hasta-Pamplona/Iruña",453,{"$f":"VLOOKUP(A583,Municipios!$B$2:$B$223,1,FALSE)","v":"Cuenca"}]
["Cuenca","Zaragoza","Cuenca-hasta-Zaragoza",328,{"$f":"VLOOKUP(A584,Municipios!$B$2:$B$223,1,FALSE)","v":"Cuenca"}]
["Cuenca","Madrid","Cuenca-hasta-Madrid",162,{"$f":"VLOOKUP(A585,Municipios!$B$2:$B$223,1,FALSE)","v":"Cuenca"}]
["Cuenca","Valladolid","Cuenca-hasta-Valladolid",400,{"$f":"VLOOKUP(A586,Municipios!$B$2:$B$223,1,FALSE)","v":"Cuenca"}]
["Cuenca","Guadalajara","Cuenca-hasta-Guadalajara",142,{"$f":"VLOOKUP(A587,Municipios!$B$2:$B$223,1,FALSE)","v":"Cuenca"}]
["Cuenca","Girona","Cuenca-hasta-Girona",627,{"$f":"VLOOKUP(A588,Municipios!$B$2:$B$223,1,FALSE)","v":"Cuenca"}]
["Cuenca","Salamanca","Cuenca-hasta-Salamanca",393,{"$f":"VLOOKUP(A589,Municipios!$B$2:$B$223,1,FALSE)","v":"Cuenca"}]
["Cuenca","Granada","Cuenca-hasta-Granada",477,{"$f":"VLOOKUP(A590,Municipios!$B$2:$B$223,1,FALSE)","v":"Cuenca"}]
["Cuenca","Palencia","Cuenca-hasta-Palencia",448,{"$f":"VLOOKUP(A591,Municipios!$B$2:$B$223,1,FALSE)","v":"Cuenca"}]
["Cuenca","Huelva","Cuenca-hasta-Huelva",680,{"$f":"VLOOKUP(A592,Municipios!$B$2:$B$223,1,FALSE)","v":"Cuenca"}]
["Cuenca","Huesca","Cuenca-hasta-Huesca",397,{"$f":"VLOOKUP(A593,Municipios!$B$2:$B$223,1,FALSE)","v":"Cuenca"}]
["Cuenca","Jaén","Cuenca-hasta-Jaén",392,{"$f":"VLOOKUP(A594,Municipios!$B$2:$B$223,1,FALSE)","v":"Cuenca"}]
["Cuenca","León","Cuenca-hasta-León",525,{"$f":"VLOOKUP(A595,Municipios!$B$2:$B$223,1,FALSE)","v":"Cuenca"}]
["Cuenca","Oviedo","Cuenca-hasta-Oviedo",623,{"$f":"VLOOKUP(A596,Municipios!$B$2:$B$223,1,FALSE)","v":"Cuenca"}]
["Cuenca","Lugo","Cuenca-hasta-Lugo",692,{"$f":"VLOOKUP(A597,Municipios!$B$2:$B$223,1,FALSE)","v":"Cuenca"}]
["Cuenca","Lleida","Cuenca-hasta-Lleida",468,{"$f":"VLOOKUP(A598,Municipios!$B$2:$B$223,1,FALSE)","v":"Cuenca"}]
["Cuenca","Murcia","Cuenca-hasta-Murcia",287,{"$f":"VLOOKUP(A599,Municipios!$B$2:$B$223,1,FALSE)","v":"Cuenca"}]
["Cuenca","Málaga","Cuenca-hasta-Málaga",610,{"$f":"VLOOKUP(A600,Municipios!$B$2:$B$223,1,FALSE)","v":"Cuenca"}]
["Cuenca","Ourense","Cuenca-hasta-Ourense",680,{"$f":"VLOOKUP(A601,Municipios!$B$2:$B$223,1,FALSE)","v":"Cuenca"}]
["Cuenca","Logroño","Cuenca-hasta-Logroño",378,{"$f":"VLOOKUP(A602,Municipios!$B$2:$B$223,1,FALSE)","v":"Cuenca"}]
["Girona","Salamanca","Girona-hasta-Salamanca",924,{"$f":"VLOOKUP(A603,Municipios!$B$2:$B$223,1,FALSE)","v":"Girona"}]
["Girona","Donostia/San Sebastián","Girona-hasta-Donostia/San Sebastián",651,{"$f":"VLOOKUP(A604,Municipios!$B$2:$B$223,1,FALSE)","v":"Girona"}]
["Girona","Santander","Girona-hasta-Santander",847,{"$f":"VLOOKUP(A605,Municipios!$B$2:$B$223,1,FALSE)","v":"Girona"}]
["Girona","Segovia","Girona-hasta-Segovia",796,{"$f":"VLOOKUP(A606,Municipios!$B$2:$B$223,1,FALSE)","v":"Girona"}]
["Girona","Sevilla","Girona-hasta-Sevilla",1119,{"$f":"VLOOKUP(A607,Municipios!$B$2:$B$223,1,FALSE)","v":"Girona"}]
["Girona","Soria","Girona-hasta-Soria",548,{"$f":"VLOOKUP(A608,Municipios!$B$2:$B$223,1,FALSE)","v":"Girona"}]
["Girona","Tarragona","Girona-hasta-Tarragona",181,{"$f":"VLOOKUP(A609,Municipios!$B$2:$B$223,1,FALSE)","v":"Girona"}]
["Girona","Teruel","Girona-hasta-Teruel",530,{"$f":"VLOOKUP(A610,Municipios!$B$2:$B$223,1,FALSE)","v":"Girona"}]
["Girona","Toledo","Girona-hasta-Toledo",769,{"$f":"VLOOKUP(A611,Municipios!$B$2:$B$223,1,FALSE)","v":"Girona"}]
["Girona","Zamora","Girona-hasta-Zamora",852,{"$f":"VLOOKUP(A612,Municipios!$B$2:$B$223,1,FALSE)","v":"Girona"}]
["Girona","Valladolid","Girona-hasta-Valladolid",803,{"$f":"VLOOKUP(A613,Municipios!$B$2:$B$223,1,FALSE)","v":"Girona"}]
["Girona","Vitoria/Gasteiz","Girona-hasta-Vitoria/Gasteiz",651,{"$f":"VLOOKUP(A614,Municipios!$B$2:$B$223,1,FALSE)","v":"Girona"}]
["Girona","Zaragoza","Girona-hasta-Zaragoza",390,{"$f":"VLOOKUP(A615,Municipios!$B$2:$B$223,1,FALSE)","v":"Girona"}]
["Girona","Pontevedra","Girona-hasta-Pontevedra",1125,{"$f":"VLOOKUP(A616,Municipios!$B$2:$B$223,1,FALSE)","v":"Girona"}]
["Girona","Huelva","Girona-hasta-Huelva",1210,{"$f":"VLOOKUP(A617,Municipios!$B$2:$B$223,1,FALSE)","v":"Girona"}]
["Girona","Valencia","Girona-hasta-Valencia",445,{"$f":"VLOOKUP(A618,Municipios!$B$2:$B$223,1,FALSE)","v":"Girona"}]
["Girona","Logroño","Girona-hasta-Logroño",561,{"$f":"VLOOKUP(A619,Municipios!$B$2:$B$223,1,FALSE)","v":"Girona"}]
["Girona","Jaén","Girona-hasta-Jaén",918,{"$f":"VLOOKUP(A620,Municipios!$B$2:$B$223,1,FALSE)","v":"Girona"}]
["Girona","Guadalajara","Girona-hasta-Guadalajara",642,{"$f":"VLOOKUP(A621,Municipios!$B$2:$B$223,1,FALSE)","v":"Girona"}]
["Girona","Pamplona/Iruña","Girona-hasta-Pamplona/Iruña",561,{"$f":"VLOOKUP(A622,Municipios!$B$2:$B$223,1,FALSE)","v":"Girona"}]
["Girona","León","Girona-hasta-León",883,{"$f":"VLOOKUP(A623,Municipios!$B$2:$B$223,1,FALSE)","v":"Girona"}]
["Girona","Granada","Girona-hasta-Granada",1016,{"$f":"VLOOKUP(A624,Municipios!$B$2:$B$223,1,FALSE)","v":"Girona"}]
["Girona","Lugo","Girona-hasta-Lugo",1104,{"$f":"VLOOKUP(A625,Municipios!$B$2:$B$223,1,FALSE)","v":"Girona"}]
["Girona","Lleida","Girona-hasta-Lleida",246,{"$f":"VLOOKUP(A626,Municipios!$B$2:$B$223,1,FALSE)","v":"Girona"}]
["Girona","Madrid","Girona-hasta-Madrid",693,{"$f":"VLOOKUP(A627,Municipios!$B$2:$B$223,1,FALSE)","v":"Girona"}]
["Girona","Málaga","Girona-hasta-Málaga",1141,{"$f":"VLOOKUP(A628,Municipios!$B$2:$B$223,1,FALSE)","v":"Girona"}]
["Girona","Murcia","Girona-hasta-Murcia",698,{"$f":"VLOOKUP(A629,Municipios!$B$2:$B$223,1,FALSE)","v":"Girona"}]
["Girona","Ourense","Girona-hasta-Ourense",1032,{"$f":"VLOOKUP(A630,Municipios!$B$2:$B$223,1,FALSE)","v":"Girona"}]
["Girona","Oviedo","Girona-hasta-Oviedo",1001,{"$f":"VLOOKUP(A631,Municipios!$B$2:$B$223,1,FALSE)","v":"Girona"}]
["Girona","Palencia","Girona-hasta-Palencia",782,{"$f":"VLOOKUP(A632,Municipios!$B$2:$B$223,1,FALSE)","v":"Girona"}]
["Girona","Huesca","Girona-hasta-Huesca",465,{"$f":"VLOOKUP(A633,Municipios!$B$2:$B$223,1,FALSE)","v":"Girona"}]
["Granada","Sevilla","Granada-hasta-Sevilla",253,{"$f":"VLOOKUP(A634,Municipios!$B$2:$B$223,1,FALSE)","v":"Granada"}]
["Granada","Pontevedra","Granada-hasta-Pontevedra",1027,{"$f":"VLOOKUP(A635,Municipios!$B$2:$B$223,1,FALSE)","v":"Granada"}]
["Granada","Salamanca","Granada-hasta-Salamanca",634,{"$f":"VLOOKUP(A636,Municipios!$B$2:$B$223,1,FALSE)","v":"Granada"}]
["Granada","Donostia/San Sebastián","Granada-hasta-Donostia/San Sebastián",887,{"$f":"VLOOKUP(A637,Municipios!$B$2:$B$223,1,FALSE)","v":"Granada"}]
["Granada","Santander","Granada-hasta-Santander",822,{"$f":"VLOOKUP(A638,Municipios!$B$2:$B$223,1,FALSE)","v":"Granada"}]
["Granada","Segovia",{"$f":"CONCATENATE(A639,\"-hasta-\",B639)","v":"Granada-hasta-Segovia"},521,{"$f":"VLOOKUP(A639,Municipios!$B$2:$B$223,1,FALSE)","v":"Granada"}]
["Granada","Soria","Granada-hasta-Soria",651,{"$f":"VLOOKUP(A640,Municipios!$B$2:$B$223,1,FALSE)","v":"Granada"}]
["Granada","Teruel","Granada-hasta-Teruel",658,{"$f":"VLOOKUP(A641,Municipios!$B$2:$B$223,1,FALSE)","v":"Granada"}]
["Granada","Toledo","Granada-hasta-Toledo",405,{"$f":"VLOOKUP(A642,Municipios!$B$2:$B$223,1,FALSE)","v":"Granada"}]
["Granada","Valencia","Granada-hasta-Valencia",661,{"$f":"VLOOKUP(A643,Municipios!$B$2:$B$223,1,FALSE)","v":"Granada"}]
["Granada","Valladolid","Granada-hasta-Valladolid",643,{"$f":"VLOOKUP(A644,Municipios!$B$2:$B$223,1,FALSE)","v":"Granada"}]
["Granada","Zaragoza","Granada-hasta-Zaragoza",736,{"$f":"VLOOKUP(A645,Municipios!$B$2:$B$223,1,FALSE)","v":"Granada"}]
["Granada","Oviedo","Granada-hasta-Oviedo",864,{"$f":"VLOOKUP(A646,Municipios!$B$2:$B$223,1,FALSE)","v":"Granada"}]
["Granada","Tarragona","Granada-hasta-Tarragona",913,{"$f":"VLOOKUP(A647,Municipios!$B$2:$B$223,1,FALSE)","v":"Granada"}]
["Granada","Zamora","Granada-hasta-Zamora",680,{"$f":"VLOOKUP(A648,Municipios!$B$2:$B$223,1,FALSE)","v":"Granada"}]
["Granada","Jaén","Granada-hasta-Jaén",91,{"$f":"VLOOKUP(A649,Municipios!$B$2:$B$223,1,FALSE)","v":"Granada"}]
["Granada","Pamplona/Iruña","Granada-hasta-Pamplona/Iruña",842,{"$f":"VLOOKUP(A650,Municipios!$B$2:$B$223,1,FALSE)","v":"Granada"}]
["Granada","Palencia","Granada-hasta-Palencia",691,{"$f":"VLOOKUP(A651,Municipios!$B$2:$B$223,1,FALSE)","v":"Granada"}]
["Granada","Guadalajara","Granada-hasta-Guadalajara",477,{"$f":"VLOOKUP(A652,Municipios!$B$2:$B$223,1,FALSE)","v":"Granada"}]
["Granada","Huesca","Granada-hasta-Huesca",807,{"$f":"VLOOKUP(A653,Municipios!$B$2:$B$223,1,FALSE)","v":"Granada"}]
["Granada","Vitoria/Gasteiz","Granada-hasta-Vitoria/Gasteiz",770,{"$f":"VLOOKUP(A654,Municipios!$B$2:$B$223,1,FALSE)","v":"Granada"}]
["Granada","León","Granada-hasta-León",766,{"$f":"VLOOKUP(A655,Municipios!$B$2:$B$223,1,FALSE)","v":"Granada"}]
["Granada","Logroño","Granada-hasta-Logroño",805,{"$f":"VLOOKUP(A656,Municipios!$B$2:$B$223,1,FALSE)","v":"Granada"}]
["Granada","Lugo","Granada-hasta-Lugo",934,{"$f":"VLOOKUP(A657,Municipios!$B$2:$B$223,1,FALSE)","v":"Granada"}]
["Granada","Lleida","Granada-hasta-Lleida",876,{"$f":"VLOOKUP(A658,Municipios!$B$2:$B$223,1,FALSE)","v":"Granada"}]
["Granada","Madrid","Granada-hasta-Madrid",418,{"$f":"VLOOKUP(A659,Municipios!$B$2:$B$223,1,FALSE)","v":"Granada"}]
["Granada","Málaga","Granada-hasta-Málaga",140,{"$f":"VLOOKUP(A660,Municipios!$B$2:$B$223,1,FALSE)","v":"Granada"}]
["Granada","Murcia","Granada-hasta-Murcia",338,{"$f":"VLOOKUP(A661,Municipios!$B$2:$B$223,1,FALSE)","v":"Granada"}]
["Granada","Ourense","Granada-hasta-Ourense",922,{"$f":"VLOOKUP(A662,Municipios!$B$2:$B$223,1,FALSE)","v":"Granada"}]
["Granada","Huelva","Granada-hasta-Huelva",339,{"$f":"VLOOKUP(A663,Municipios!$B$2:$B$223,1,FALSE)","v":"Granada"}]
["Guadalajara","Tarragona","Guadalajara-hasta-Tarragona",525,{"$f":"VLOOKUP(A664,Municipios!$B$2:$B$223,1,FALSE)","v":"Guadalajara"}]
["Guadalajara","León","Guadalajara-hasta-León",399,{"$f":"VLOOKUP(A665,Municipios!$B$2:$B$223,1,FALSE)","v":"Guadalajara"}]
["Guadalajara","Santander","Guadalajara-hasta-Santander",410,{"$f":"VLOOKUP(A666,Municipios!$B$2:$B$223,1,FALSE)","v":"Guadalajara"}]
["Guadalajara","Segovia","Guadalajara-hasta-Segovia",148,{"$f":"VLOOKUP(A667,Municipios!$B$2:$B$223,1,FALSE)","v":"Guadalajara"}]
["Guadalajara","Sevilla","Guadalajara-hasta-Sevilla",586,{"$f":"VLOOKUP(A668,Municipios!$B$2:$B$223,1,FALSE)","v":"Guadalajara"}]
["Guadalajara","Soria","Guadalajara-hasta-Soria",169,{"$f":"VLOOKUP(A669,Municipios!$B$2:$B$223,1,FALSE)","v":"Guadalajara"}]
["Guadalajara","Teruel","Guadalajara-hasta-Teruel",251,{"$f":"VLOOKUP(A670,Municipios!$B$2:$B$223,1,FALSE)","v":"Guadalajara"}]
["Guadalajara","Toledo","Guadalajara-hasta-Toledo",127,{"$f":"VLOOKUP(A671,Municipios!$B$2:$B$223,1,FALSE)","v":"Guadalajara"}]
["Guadalajara","Valencia","Guadalajara-hasta-Valencia",306,{"$f":"VLOOKUP(A672,Municipios!$B$2:$B$223,1,FALSE)","v":"Guadalajara"}]
["Guadalajara","Valladolid","Guadalajara-hasta-Valladolid",254,{"$f":"VLOOKUP(A673,Municipios!$B$2:$B$223,1,FALSE)","v":"Guadalajara"}]
["Guadalajara","Vitoria/Gasteiz","Guadalajara-hasta-Vitoria/Gasteiz",346,{"$f":"VLOOKUP(A674,Municipios!$B$2:$B$223,1,FALSE)","v":"Guadalajara"}]
["Guadalajara","Zamora","Guadalajara-hasta-Zamora",313,{"$f":"VLOOKUP(A675,Municipios!$B$2:$B$223,1,FALSE)","v":"Guadalajara"}]
["Guadalajara","Pontevedra","Guadalajara-hasta-Pontevedra",659,{"$f":"VLOOKUP(A676,Municipios!$B$2:$B$223,1,FALSE)","v":"Guadalajara"}]
["Guadalajara","Zaragoza","Guadalajara-hasta-Zaragoza",260,{"$f":"VLOOKUP(A677,Municipios!$B$2:$B$223,1,FALSE)","v":"Guadalajara"}]
["Guadalajara","Huesca","Guadalajara-hasta-Huesca",331,{"$f":"VLOOKUP(A678,Municipios!$B$2:$B$223,1,FALSE)","v":"Guadalajara"}]
["Guadalajara","Huelva","Guadalajara-hasta-Huelva",677,{"$f":"VLOOKUP(A679,Municipios!$B$2:$B$223,1,FALSE)","v":"Guadalajara"}]
["Guadalajara","Salamanca","Guadalajara-hasta-Salamanca",267,{"$f":"VLOOKUP(A680,Municipios!$B$2:$B$223,1,FALSE)","v":"Guadalajara"}]
["Guadalajara","Jaén","Guadalajara-hasta-Jaén",385,{"$f":"VLOOKUP(A681,Municipios!$B$2:$B$223,1,FALSE)","v":"Guadalajara"}]
["Guadalajara","Logroño","Guadalajara-hasta-Logroño",274,{"$f":"VLOOKUP(A682,Municipios!$B$2:$B$223,1,FALSE)","v":"Guadalajara"}]
["Guadalajara","Lugo","Guadalajara-hasta-Lugo",566,{"$f":"VLOOKUP(A683,Municipios!$B$2:$B$223,1,FALSE)","v":"Guadalajara"}]
["Guadalajara","Lleida","Guadalajara-hasta-Lleida",421,{"$f":"VLOOKUP(A684,Municipios!$B$2:$B$223,1,FALSE)","v":"Guadalajara"}]
["Guadalajara","Málaga","Guadalajara-hasta-Málaga",607,{"$f":"VLOOKUP(A685,Municipios!$B$2:$B$223,1,FALSE)","v":"Guadalajara"}]
["Guadalajara","Murcia","Guadalajara-hasta-Murcia",439,{"$f":"VLOOKUP(A686,Municipios!$B$2:$B$223,1,FALSE)","v":"Guadalajara"}]
["Guadalajara","Ourense","Guadalajara-hasta-Ourense",554,{"$f":"VLOOKUP(A687,Municipios!$B$2:$B$223,1,FALSE)","v":"Guadalajara"}]
["Guadalajara","Oviedo","Guadalajara-hasta-Oviedo",497,{"$f":"VLOOKUP(A688,Municipios!$B$2:$B$223,1,FALSE)","v":"Guadalajara"}]
["Guadalajara","Palencia","Guadalajara-hasta-Palencia",322,{"$f":"VLOOKUP(A689,Municipios!$B$2:$B$223,1,FALSE)","v":"Guadalajara"}]
["Guadalajara","Pamplona/Iruña","Guadalajara-hasta-Pamplona/Iruña",436,{"$f":"VLOOKUP(A690,Municipios!$B$2:$B$223,1,FALSE)","v":"Guadalajara"}]
["Guadalajara","Madrid","Guadalajara-hasta-Madrid",51,{"$f":"VLOOKUP(A691,Municipios!$B$2:$B$223,1,FALSE)","v":"Guadalajara"}]
["Guadalajara","Donostia/San Sebastián","Guadalajara-hasta-Donostia/San Sebastián",463,{"$f":"VLOOKUP(A692,Municipios!$B$2:$B$223,1,FALSE)","v":"Guadalajara"}]
["Huelva","Zaragoza","Huelva-hasta-Zaragoza",937,{"$f":"VLOOKUP(A693,Municipios!$B$2:$B$223,1,FALSE)","v":"Huelva"}]
["Huelva","Santander","Huelva-hasta-Santander",919,{"$f":"VLOOKUP(A694,Municipios!$B$2:$B$223,1,FALSE)","v":"Huelva"}]
["Huelva","Segovia","Huelva-hasta-Segovia",647,{"$f":"VLOOKUP(A695,Municipios!$B$2:$B$223,1,FALSE)","v":"Huelva"}]
["Huelva","Soria","Huelva-hasta-Soria",846,{"$f":"VLOOKUP(A696,Municipios!$B$2:$B$223,1,FALSE)","v":"Huelva"}]
["Huelva","Teruel","Huelva-hasta-Teruel",842,{"$f":"VLOOKUP(A697,Municipios!$B$2:$B$223,1,FALSE)","v":"Huelva"}]
["Huelva","Toledo","Huelva-hasta-Toledo",611,{"$f":"VLOOKUP(A698,Municipios!$B$2:$B$223,1,FALSE)","v":"Huelva"}]
["Huelva","Valencia","Huelva-hasta-Valencia",777,{"$f":"VLOOKUP(A699,Municipios!$B$2:$B$223,1,FALSE)","v":"Huelva"}]
["Huelva","Valladolid","Huelva-hasta-Valladolid",679,{"$f":"VLOOKUP(A700,Municipios!$B$2:$B$223,1,FALSE)","v":"Huelva"}]
["Huelva","Zamora","Huelva-hasta-Zamora",624,{"$f":"VLOOKUP(A701,Municipios!$B$2:$B$223,1,FALSE)","v":"Huelva"}]
["Huelva","Donostia/San Sebastián","Huelva-hasta-Donostia/San Sebastián",1087,{"$f":"VLOOKUP(A702,Municipios!$B$2:$B$223,1,FALSE)","v":"Huelva"}]
["Huelva","Sevilla",{"$f":"CONCATENATE(A703,\"-hasta-\",B703)","v":"Huelva-hasta-Sevilla"},85,{"$f":"VLOOKUP(A703,Municipios!$B$2:$B$223,1,FALSE)","v":"Huelva"}]
["Huelva","Vitoria/Gasteiz","Huelva-hasta-Vitoria/Gasteiz",970,{"$f":"VLOOKUP(A704,Municipios!$B$2:$B$223,1,FALSE)","v":"Huelva"}]
["Huelva","Lugo","Huelva-hasta-Lugo",924,{"$f":"VLOOKUP(A705,Municipios!$B$2:$B$223,1,FALSE)","v":"Huelva"}]
["Huelva","Tarragona","Huelva-hasta-Tarragona",1032,{"$f":"VLOOKUP(A706,Municipios!$B$2:$B$223,1,FALSE)","v":"Huelva"}]
["Huelva","Salamanca","Huelva-hasta-Salamanca",558,{"$f":"VLOOKUP(A707,Municipios!$B$2:$B$223,1,FALSE)","v":"Huelva"}]
["Huelva","Jaén","Huelva-hasta-Jaén",369,{"$f":"VLOOKUP(A708,Municipios!$B$2:$B$223,1,FALSE)","v":"Huelva"}]
["Huelva","León","Huelva-hasta-León",759,{"$f":"VLOOKUP(A709,Municipios!$B$2:$B$223,1,FALSE)","v":"Huelva"}]
["Huelva","Logroño","Huelva-hasta-Logroño",1005,{"$f":"VLOOKUP(A710,Municipios!$B$2:$B$223,1,FALSE)","v":"Huelva"}]
["Huelva","Lleida","Huelva-hasta-Lleida",1098,{"$f":"VLOOKUP(A711,Municipios!$B$2:$B$223,1,FALSE)","v":"Huelva"}]
["Huelva","Madrid","Huelva-hasta-Madrid",620,{"$f":"VLOOKUP(A712,Municipios!$B$2:$B$223,1,FALSE)","v":"Huelva"}]
["Huelva","Málaga","Huelva-hasta-Málaga",285,{"$f":"VLOOKUP(A713,Municipios!$B$2:$B$223,1,FALSE)","v":"Huelva"}]
["Huelva","Palencia","Huelva-hasta-Palencia",788,{"$f":"VLOOKUP(A714,Municipios!$B$2:$B$223,1,FALSE)","v":"Huelva"}]
["Huelva","Pontevedra","Huelva-hasta-Pontevedra",1004,{"$f":"VLOOKUP(A715,Municipios!$B$2:$B$223,1,FALSE)","v":"Huelva"}]
["Huelva","Huesca","Huelva-hasta-Huesca",1008,{"$f":"VLOOKUP(A716,Municipios!$B$2:$B$223,1,FALSE)","v":"Huelva"}]
["Huelva","Pamplona/Iruña","Huelva-hasta-Pamplona/Iruña",1060,{"$f":"VLOOKUP(A717,Municipios!$B$2:$B$223,1,FALSE)","v":"Huelva"}]
["Huelva","Murcia","Huelva-hasta-Murcia",686,{"$f":"VLOOKUP(A718,Municipios!$B$2:$B$223,1,FALSE)","v":"Huelva"}]
["Huelva","Oviedo","Huelva-hasta-Oviedo",878,{"$f":"VLOOKUP(A719,Municipios!$B$2:$B$223,1,FALSE)","v":"Huelva"}]
["Huelva","Ourense","Huelva-hasta-Ourense",916,{"$f":"VLOOKUP(A720,Municipios!$B$2:$B$223,1,FALSE)","v":"Huelva"}]
["Alicante/Alacant","Teruel","Alicante/Alacant-hasta-Teruel",328,{"$f":"VLOOKUP(A721,Municipios!$B$2:$B$223,1,FALSE)","v":"Alicante/Alacant"}]
["Alicante/Alacant","Pamplona/Iruña","Alicante/Alacant-hasta-Pamplona/Iruña",705,{"$f":"VLOOKUP(A722,Municipios!$B$2:$B$223,1,FALSE)","v":"Alicante/Alacant"}]
["Alicante/Alacant","Barcelona","Alicante/Alacant-hasta-Barcelona",546,{"$f":"VLOOKUP(A723,Municipios!$B$2:$B$223,1,FALSE)","v":"Alicante/Alacant"}]
["Alicante/Alacant","Pontevedra","Alicante/Alacant-hasta-Pontevedra",1031,{"$f":"VLOOKUP(A724,Municipios!$B$2:$B$223,1,FALSE)","v":"Alicante/Alacant"}]
["Alicante/Alacant","Segovia","Alicante/Alacant-hasta-Segovia",535,{"$f":"VLOOKUP(A725,Municipios!$B$2:$B$223,1,FALSE)","v":"Alicante/Alacant"}]
["Alicante/Alacant","Sevilla","Alicante/Alacant-hasta-Sevilla",656,{"$f":"VLOOKUP(A726,Municipios!$B$2:$B$223,1,FALSE)","v":"Alicante/Alacant"}]
["Alicante/Alacant","Soria","Alicante/Alacant-hasta-Soria",577,{"$f":"VLOOKUP(A727,Municipios!$B$2:$B$223,1,FALSE)","v":"Alicante/Alacant"}]
["Alicante/Alacant","Ávila","Alicante/Alacant-hasta-Ávila",555,{"$f":"VLOOKUP(A728,Municipios!$B$2:$B$223,1,FALSE)","v":"Alicante/Alacant"}]
["Alicante/Alacant","Tarragona","Alicante/Alacant-hasta-Tarragona",448,{"$f":"VLOOKUP(A729,Municipios!$B$2:$B$223,1,FALSE)","v":"Alicante/Alacant"}]
["Alicante/Alacant","Donostia/San Sebastián","Alicante/Alacant-hasta-Donostia/San Sebastián",795,{"$f":"VLOOKUP(A730,Municipios!$B$2:$B$223,1,FALSE)","v":"Alicante/Alacant"}]
["Alicante/Alacant","Toledo","Alicante/Alacant-hasta-Toledo",454,{"$f":"VLOOKUP(A731,Municipios!$B$2:$B$223,1,FALSE)","v":"Alicante/Alacant"}]
["Alicante/Alacant","Valencia","Alicante/Alacant-hasta-Valencia",195,{"$f":"VLOOKUP(A732,Municipios!$B$2:$B$223,1,FALSE)","v":"Alicante/Alacant"}]
["Alicante/Alacant","Valladolid","Alicante/Alacant-hasta-Valladolid",647,{"$f":"VLOOKUP(A733,Municipios!$B$2:$B$223,1,FALSE)","v":"Alicante/Alacant"}]
["Alicante/Alacant","Vitoria/Gasteiz","Alicante/Alacant-hasta-Vitoria/Gasteiz",761,{"$f":"VLOOKUP(A734,Municipios!$B$2:$B$223,1,FALSE)","v":"Alicante/Alacant"}]
["Alicante/Alacant","Zamora","Alicante/Alacant-hasta-Zamora",694,{"$f":"VLOOKUP(A735,Municipios!$B$2:$B$223,1,FALSE)","v":"Alicante/Alacant"}]
["Alicante/Alacant","Badajoz","Alicante/Alacant-hasta-Badajoz",684,{"$f":"VLOOKUP(A736,Municipios!$B$2:$B$223,1,FALSE)","v":"Alicante/Alacant"}]
["Alicante/Alacant","Bilbao","Alicante/Alacant-hasta-Bilbao",797,{"$f":"VLOOKUP(A737,Municipios!$B$2:$B$223,1,FALSE)","v":"Alicante/Alacant"}]
["Alicante/Alacant","Burgos","Alicante/Alacant-hasta-Burgos",653,{"$f":"VLOOKUP(A738,Municipios!$B$2:$B$223,1,FALSE)","v":"Alicante/Alacant"}]
["Alicante/Alacant","Cáceres","Alicante/Alacant-hasta-Cáceres",678,{"$f":"VLOOKUP(A739,Municipios!$B$2:$B$223,1,FALSE)","v":"Alicante/Alacant"}]
["Alicante/Alacant","Palencia","Alicante/Alacant-hasta-Palencia",695,{"$f":"VLOOKUP(A740,Municipios!$B$2:$B$223,1,FALSE)","v":"Alicante/Alacant"}]
["Alicante/Alacant","Salamanca","Alicante/Alacant-hasta-Salamanca",648,{"$f":"VLOOKUP(A741,Municipios!$B$2:$B$223,1,FALSE)","v":"Alicante/Alacant"}]
["Alicante/Alacant","Zaragoza","Alicante/Alacant-hasta-Zaragoza",530,{"$f":"VLOOKUP(A742,Municipios!$B$2:$B$223,1,FALSE)","v":"Alicante/Alacant"}]
["Alicante/Alacant","Coruña (A)","Alicante/Alacant-hasta-Coruña (A)",1026,{"$f":"VLOOKUP(A743,Municipios!$B$2:$B$223,1,FALSE)","v":"Alicante/Alacant"}]
["Alicante/Alacant","Santander","Alicante/Alacant-hasta-Santander",819,{"$f":"VLOOKUP(A744,Municipios!$B$2:$B$223,1,FALSE)","v":"Alicante/Alacant"}]
["Alicante/Alacant","Cádiz","Alicante/Alacant-hasta-Cádiz",760,{"$f":"VLOOKUP(A745,Municipios!$B$2:$B$223,1,FALSE)","v":"Alicante/Alacant"}]
["Alicante/Alacant","Castellón de la Plana/Castelló de la Plana","Alicante/Alacant-hasta-Castellón de la Plana/Castelló de la Plana",262,{"$f":"VLOOKUP(A746,Municipios!$B$2:$B$223,1,FALSE)","v":"Alicante/Alacant"}]
["Alicante/Alacant","Oviedo","Alicante/Alacant-hasta-Oviedo",878,{"$f":"VLOOKUP(A747,Municipios!$B$2:$B$223,1,FALSE)","v":"Alicante/Alacant"}]
["Alicante/Alacant","Córdoba","Alicante/Alacant-hasta-Córdoba",519,{"$f":"VLOOKUP(A748,Municipios!$B$2:$B$223,1,FALSE)","v":"Alicante/Alacant"}]
["Alicante/Alacant","Cuenca","Alicante/Alacant-hasta-Cuenca",307,{"$f":"VLOOKUP(A749,Municipios!$B$2:$B$223,1,FALSE)","v":"Alicante/Alacant"}]
["Alicante/Alacant","Girona","Alicante/Alacant-hasta-Girona",629,{"$f":"VLOOKUP(A750,Municipios!$B$2:$B$223,1,FALSE)","v":"Alicante/Alacant"}]
["Alicante/Alacant","Granada","Alicante/Alacant-hasta-Granada",472,{"$f":"VLOOKUP(A751,Municipios!$B$2:$B$223,1,FALSE)","v":"Alicante/Alacant"}]
["Alicante/Alacant","Guadalajara","Alicante/Alacant-hasta-Guadalajara",469,{"$f":"VLOOKUP(A752,Municipios!$B$2:$B$223,1,FALSE)","v":"Alicante/Alacant"}]
["Alicante/Alacant","Huelva","Alicante/Alacant-hasta-Huelva",474,{"$f":"VLOOKUP(A753,Municipios!$B$2:$B$223,1,FALSE)","v":"Alicante/Alacant"}]
["Alicante/Alacant","Málaga","Alicante/Alacant-hasta-Málaga",499,{"$f":"VLOOKUP(A754,Municipios!$B$2:$B$223,1,FALSE)","v":"Alicante/Alacant"}]
["Alicante/Alacant","Ciudad Real","Alicante/Alacant-hasta-Ciudad Real",373,{"$f":"VLOOKUP(A755,Municipios!$B$2:$B$223,1,FALSE)","v":"Alicante/Alacant"}]
["Alicante/Alacant","Huesca","Alicante/Alacant-hasta-Huesca",603,{"$f":"VLOOKUP(A756,Municipios!$B$2:$B$223,1,FALSE)","v":"Alicante/Alacant"}]
["Alicante/Alacant","Murcia","Alicante/Alacant-hasta-Murcia",69,{"$f":"VLOOKUP(A757,Municipios!$B$2:$B$223,1,FALSE)","v":"Alicante/Alacant"}]
["Alicante/Alacant","Ourense","Alicante/Alacant-hasta-Ourense",926,{"$f":"VLOOKUP(A758,Municipios!$B$2:$B$223,1,FALSE)","v":"Alicante/Alacant"}]
["Alicante/Alacant","Madrid","Alicante/Alacant-hasta-Madrid",417,{"$f":"VLOOKUP(A759,Municipios!$B$2:$B$223,1,FALSE)","v":"Alicante/Alacant"}]
["Alicante/Alacant","Lleida","Alicante/Alacant-hasta-Lleida",576,{"$f":"VLOOKUP(A760,Municipios!$B$2:$B$223,1,FALSE)","v":"Alicante/Alacant"}]
["Alicante/Alacant","Lugo","Alicante/Alacant-hasta-Lugo",938,{"$f":"VLOOKUP(A761,Municipios!$B$2:$B$223,1,FALSE)","v":"Alicante/Alacant"}]
["Alicante/Alacant","Logroño","Alicante/Alacant-hasta-Logroño",698,{"$f":"VLOOKUP(A762,Municipios!$B$2:$B$223,1,FALSE)","v":"Alicante/Alacant"}]
["Alicante/Alacant","León","Alicante/Alacant-hasta-León",780,{"$f":"VLOOKUP(A763,Municipios!$B$2:$B$223,1,FALSE)","v":"Alicante/Alacant"}]
["Alicante/Alacant","Jaén","Alicante/Alacant-hasta-Jaén",455,{"$f":"VLOOKUP(A764,Municipios!$B$2:$B$223,1,FALSE)","v":"Alicante/Alacant"}]
["Alicante/Alacant","Almería","Alicante/Alacant-hasta-Almería",281,{"$f":"VLOOKUP(A765,Municipios!$B$2:$B$223,1,FALSE)","v":"Alicante/Alacant"}]
["Huesca","Donostia/San Sebastián","Huesca-hasta-Donostia/San Sebastián",269,{"$f":"VLOOKUP(A766,Municipios!$B$2:$B$223,1,FALSE)","v":"Huesca"}]
["Huesca","Teruel",{"$f":"CONCATENATE(A767,\"-hasta-\",B767)","v":"Huesca-hasta-Teruel"},256,{"$f":"VLOOKUP(A767,Municipios!$B$2:$B$223,1,FALSE)","v":"Huesca"}]
["Huesca","Segovia","Huesca-hasta-Segovia",421,{"$f":"VLOOKUP(A768,Municipios!$B$2:$B$223,1,FALSE)","v":"Huesca"}]
["Huesca","Sevilla","Huesca-hasta-Sevilla",917,{"$f":"VLOOKUP(A769,Municipios!$B$2:$B$223,1,FALSE)","v":"Huesca"}]
["Huesca","Soria","Huesca-hasta-Soria",230,{"$f":"VLOOKUP(A770,Municipios!$B$2:$B$223,1,FALSE)","v":"Huesca"}]
["Huesca","Tarragona","Huesca-hasta-Tarragona",216,{"$f":"VLOOKUP(A771,Municipios!$B$2:$B$223,1,FALSE)","v":"Huesca"}]
["Huesca","Toledo","Huesca-hasta-Toledo",458,{"$f":"VLOOKUP(A772,Municipios!$B$2:$B$223,1,FALSE)","v":"Huesca"}]
["Huesca","Valencia","Huesca-hasta-Valencia",453,{"$f":"VLOOKUP(A773,Municipios!$B$2:$B$223,1,FALSE)","v":"Huesca"}]
["Huesca","Valladolid","Huesca-hasta-Valladolid",510,{"$f":"VLOOKUP(A774,Municipios!$B$2:$B$223,1,FALSE)","v":"Huesca"}]
["Huesca","Zamora","Huesca-hasta-Zamora",532,{"$f":"VLOOKUP(A775,Municipios!$B$2:$B$223,1,FALSE)","v":"Huesca"}]
["Huesca","Zaragoza","Huesca-hasta-Zaragoza",70,{"$f":"VLOOKUP(A776,Municipios!$B$2:$B$223,1,FALSE)","v":"Huesca"}]
["Huesca","Málaga","Huesca-hasta-Málaga",938,{"$f":"VLOOKUP(A777,Municipios!$B$2:$B$223,1,FALSE)","v":"Huesca"}]
["Huesca","Salamanca","Huesca-hasta-Salamanca",630,{"$f":"VLOOKUP(A778,Municipios!$B$2:$B$223,1,FALSE)","v":"Huesca"}]
["Huesca","Vitoria/Gasteiz","Huesca-hasta-Vitoria/Gasteiz",269,{"$f":"VLOOKUP(A779,Municipios!$B$2:$B$223,1,FALSE)","v":"Huesca"}]
["Huesca","Lleida","Huesca-hasta-Lleida",119,{"$f":"VLOOKUP(A780,Municipios!$B$2:$B$223,1,FALSE)","v":"Huesca"}]
["Huesca","Santander","Huesca-hasta-Santander",539,{"$f":"VLOOKUP(A781,Municipios!$B$2:$B$223,1,FALSE)","v":"Huesca"}]
["Huesca","León","Huesca-hasta-León",575,{"$f":"VLOOKUP(A782,Municipios!$B$2:$B$223,1,FALSE)","v":"Huesca"}]
["Huesca","Pontevedra","Huesca-hasta-Pontevedra",818,{"$f":"VLOOKUP(A783,Municipios!$B$2:$B$223,1,FALSE)","v":"Huesca"}]
["Huesca","Lugo","Huesca-hasta-Lugo",796,{"$f":"VLOOKUP(A784,Municipios!$B$2:$B$223,1,FALSE)","v":"Huesca"}]
["Huesca","Jaén","Huesca-hasta-Jaén",715,{"$f":"VLOOKUP(A785,Municipios!$B$2:$B$223,1,FALSE)","v":"Huesca"}]
["Huesca","Madrid","Huesca-hasta-Madrid",382,{"$f":"VLOOKUP(A786,Municipios!$B$2:$B$223,1,FALSE)","v":"Huesca"}]
["Huesca","Murcia","Huesca-hasta-Murcia",622,{"$f":"VLOOKUP(A787,Municipios!$B$2:$B$223,1,FALSE)","v":"Huesca"}]
["Huesca","Ourense","Huesca-hasta-Ourense",724,{"$f":"VLOOKUP(A788,Municipios!$B$2:$B$223,1,FALSE)","v":"Huesca"}]
["Huesca","Oviedo","Huesca-hasta-Oviedo",693,{"$f":"VLOOKUP(A789,Municipios!$B$2:$B$223,1,FALSE)","v":"Huesca"}]
["Huesca","Palencia","Huesca-hasta-Palencia",489,{"$f":"VLOOKUP(A790,Municipios!$B$2:$B$223,1,FALSE)","v":"Huesca"}]
["Huesca","Pamplona/Iruña","Huesca-hasta-Pamplona/Iruña",179,{"$f":"VLOOKUP(A791,Municipios!$B$2:$B$223,1,FALSE)","v":"Huesca"}]
["Huesca","Logroño","Huesca-hasta-Logroño",241,{"$f":"VLOOKUP(A792,Municipios!$B$2:$B$223,1,FALSE)","v":"Huesca"}]
["Jaén","Segovia","Jaén-hasta-Segovia",430,{"$f":"VLOOKUP(A793,Municipios!$B$2:$B$223,1,FALSE)","v":"Jaén"}]
["Jaén","Sevilla","Jaén-hasta-Sevilla",272,{"$f":"VLOOKUP(A794,Municipios!$B$2:$B$223,1,FALSE)","v":"Jaén"}]
["Jaén","Soria","Jaén-hasta-Soria",554,{"$f":"VLOOKUP(A795,Municipios!$B$2:$B$223,1,FALSE)","v":"Jaén"}]
["Jaén","Tarragona","Jaén-hasta-Tarragona",739,{"$f":"VLOOKUP(A796,Municipios!$B$2:$B$223,1,FALSE)","v":"Jaén"}]
["Jaén","Teruel","Jaén-hasta-Teruel",543,{"$f":"VLOOKUP(A797,Municipios!$B$2:$B$223,1,FALSE)","v":"Jaén"}]
["Jaén","Toledo","Jaén-hasta-Toledo",316,{"$f":"VLOOKUP(A798,Municipios!$B$2:$B$223,1,FALSE)","v":"Jaén"}]
["Jaén","Valencia","Jaén-hasta-Valencia",484,{"$f":"VLOOKUP(A799,Municipios!$B$2:$B$223,1,FALSE)","v":"Jaén"}]
["Jaén","Valladolid","Jaén-hasta-Valladolid",550,{"$f":"VLOOKUP(A800,Municipios!$B$2:$B$223,1,FALSE)","v":"Jaén"}]
["Jaén","Santander","Jaén-hasta-Santander",721,{"$f":"VLOOKUP(A801,Municipios!$B$2:$B$223,1,FALSE)","v":"Jaén"}]
["Jaén","Zamora","Jaén-hasta-Zamora",589,{"$f":"VLOOKUP(A802,Municipios!$B$2:$B$223,1,FALSE)","v":"Jaén"}]
["Jaén","Málaga","Jaén-hasta-Málaga",231,{"$f":"VLOOKUP(A803,Municipios!$B$2:$B$223,1,FALSE)","v":"Jaén"}]
["Jaén","Vitoria/Gasteiz","Jaén-hasta-Vitoria/Gasteiz",678,{"$f":"VLOOKUP(A804,Municipios!$B$2:$B$223,1,FALSE)","v":"Jaén"}]
["Jaén","Donostia/San Sebastián","Jaén-hasta-Donostia/San Sebastián",795,{"$f":"VLOOKUP(A805,Municipios!$B$2:$B$223,1,FALSE)","v":"Jaén"}]
["Jaén","Salamanca","Jaén-hasta-Salamanca",543,{"$f":"VLOOKUP(A806,Municipios!$B$2:$B$223,1,FALSE)","v":"Jaén"}]
["Jaén","Pontevedra","Jaén-hasta-Pontevedra",936,{"$f":"VLOOKUP(A807,Municipios!$B$2:$B$223,1,FALSE)","v":"Jaén"}]
["Jaén","Pamplona/Iruña","Jaén-hasta-Pamplona/Iruña",751,{"$f":"VLOOKUP(A808,Municipios!$B$2:$B$223,1,FALSE)","v":"Jaén"}]
["Jaén","Palencia","Jaén-hasta-Palencia",600,{"$f":"VLOOKUP(A809,Municipios!$B$2:$B$223,1,FALSE)","v":"Jaén"}]
["Jaén","Ourense","Jaén-hasta-Ourense",831,{"$f":"VLOOKUP(A810,Municipios!$B$2:$B$223,1,FALSE)","v":"Jaén"}]
["Jaén","Madrid","Jaén-hasta-Madrid",327,{"$f":"VLOOKUP(A811,Municipios!$B$2:$B$223,1,FALSE)","v":"Jaén"}]
["Jaén","Lleida","Jaén-hasta-Lleida",806,{"$f":"VLOOKUP(A812,Municipios!$B$2:$B$223,1,FALSE)","v":"Jaén"}]
["Jaén","Lugo","Jaén-hasta-Lugo",843,{"$f":"VLOOKUP(A813,Municipios!$B$2:$B$223,1,FALSE)","v":"Jaén"}]
["Jaén","Logroño","Jaén-hasta-Logroño",712,{"$f":"VLOOKUP(A814,Municipios!$B$2:$B$223,1,FALSE)","v":"Jaén"}]
["Jaén","León","Jaén-hasta-León",675,{"$f":"VLOOKUP(A815,Municipios!$B$2:$B$223,1,FALSE)","v":"Jaén"}]
["Jaén","Zaragoza","Jaén-hasta-Zaragoza",645,{"$f":"VLOOKUP(A816,Municipios!$B$2:$B$223,1,FALSE)","v":"Jaén"}]
["Jaén","Oviedo","Jaén-hasta-Oviedo",773,{"$f":"VLOOKUP(A817,Municipios!$B$2:$B$223,1,FALSE)","v":"Jaén"}]
["Jaén","Murcia","Jaén-hasta-Murcia",429,{"$f":"VLOOKUP(A818,Municipios!$B$2:$B$223,1,FALSE)","v":"Jaén"}]
["León","Salamanca","León-hasta-Salamanca",202,{"$f":"VLOOKUP(A819,Municipios!$B$2:$B$223,1,FALSE)","v":"León"}]
["León","Zamora","León-hasta-Zamora",139,{"$f":"VLOOKUP(A820,Municipios!$B$2:$B$223,1,FALSE)","v":"León"}]
["León","Vitoria/Gasteiz","León-hasta-Vitoria/Gasteiz",296,{"$f":"VLOOKUP(A821,Municipios!$B$2:$B$223,1,FALSE)","v":"León"}]
["León","Valladolid","León-hasta-Valladolid",136,{"$f":"VLOOKUP(A822,Municipios!$B$2:$B$223,1,FALSE)","v":"León"}]
["León","Valencia","León-hasta-Valencia",710,{"$f":"VLOOKUP(A823,Municipios!$B$2:$B$223,1,FALSE)","v":"León"}]
["León","Toledo","León-hasta-Toledo",414,{"$f":"VLOOKUP(A824,Municipios!$B$2:$B$223,1,FALSE)","v":"León"}]
["León","Teruel","León-hasta-Teruel",558,{"$f":"VLOOKUP(A825,Municipios!$B$2:$B$223,1,FALSE)","v":"León"}]
["León","Tarragona","León-hasta-Tarragona",763,{"$f":"VLOOKUP(A826,Municipios!$B$2:$B$223,1,FALSE)","v":"León"}]
["León","Soria","León-hasta-Soria",336,{"$f":"VLOOKUP(A827,Municipios!$B$2:$B$223,1,FALSE)","v":"León"}]
["León","Sevilla","León-hasta-Sevilla",668,{"$f":"VLOOKUP(A828,Municipios!$B$2:$B$223,1,FALSE)","v":"León"}]
["León","Segovia","León-hasta-Segovia",278,{"$f":"VLOOKUP(A829,Municipios!$B$2:$B$223,1,FALSE)","v":"León"}]
["León","Zaragoza","León-hasta-Zaragoza",500,{"$f":"VLOOKUP(A830,Municipios!$B$2:$B$223,1,FALSE)","v":"León"}]
["León","Donostia/San Sebastián",{"$f":"CONCATENATE(A831,\"-hasta-\",B831)","v":"León-hasta-Donostia/San Sebastián"},413,{"$f":"VLOOKUP(A831,Municipios!$B$2:$B$223,1,FALSE)","v":"León"}]
["León","Lleida","León-hasta-Lleida",679,{"$f":"VLOOKUP(A832,Municipios!$B$2:$B$223,1,FALSE)","v":"León"}]
["León","Pontevedra","León-hasta-Pontevedra",366,{"$f":"VLOOKUP(A833,Municipios!$B$2:$B$223,1,FALSE)","v":"León"}]
["León","Pamplona/Iruña","León-hasta-Pamplona/Iruña",386,{"$f":"VLOOKUP(A834,Municipios!$B$2:$B$223,1,FALSE)","v":"León"}]
["León","Palencia","León-hasta-Palencia",125,{"$f":"VLOOKUP(A835,Municipios!$B$2:$B$223,1,FALSE)","v":"León"}]
["León","Oviedo","León-hasta-Oviedo",118,{"$f":"VLOOKUP(A836,Municipios!$B$2:$B$223,1,FALSE)","v":"León"}]
["León","Ourense","León-hasta-Ourense",261,{"$f":"VLOOKUP(A837,Municipios!$B$2:$B$223,1,FALSE)","v":"León"}]
["León","Murcia","León-hasta-Murcia",751,{"$f":"VLOOKUP(A838,Municipios!$B$2:$B$223,1,FALSE)","v":"León"}]
["León","Málaga","León-hasta-Málaga",898,{"$f":"VLOOKUP(A839,Municipios!$B$2:$B$223,1,FALSE)","v":"León"}]
["León","Madrid","León-hasta-Madrid",336,{"$f":"VLOOKUP(A840,Municipios!$B$2:$B$223,1,FALSE)","v":"León"}]
["León","Lugo","León-hasta-Lugo",217,{"$f":"VLOOKUP(A841,Municipios!$B$2:$B$223,1,FALSE)","v":"León"}]
["León","Santander","León-hasta-Santander",341,{"$f":"VLOOKUP(A842,Municipios!$B$2:$B$223,1,FALSE)","v":"León"}]
["León","Logroño","León-hasta-Logroño",329,{"$f":"VLOOKUP(A843,Municipios!$B$2:$B$223,1,FALSE)","v":"León"}]
["Logroño","Teruel","Logroño-hasta-Teruel",352,{"$f":"VLOOKUP(A844,Municipios!$B$2:$B$223,1,FALSE)","v":"Logroño"}]
["Logroño","Málaga","Logroño-hasta-Málaga",883,{"$f":"VLOOKUP(A845,Municipios!$B$2:$B$223,1,FALSE)","v":"Logroño"}]
["Logroño","Zaragoza","Logroño-hasta-Zaragoza",171,{"$f":"VLOOKUP(A846,Municipios!$B$2:$B$223,1,FALSE)","v":"Logroño"}]
["Logroño","Zamora","Logroño-hasta-Zamora",351,{"$f":"VLOOKUP(A847,Municipios!$B$2:$B$223,1,FALSE)","v":"Logroño"}]
["Logroño","Vitoria/Gasteiz","Logroño-hasta-Vitoria/Gasteiz",89,{"$f":"VLOOKUP(A848,Municipios!$B$2:$B$223,1,FALSE)","v":"Logroño"}]
["Logroño","Valladolid","Logroño-hasta-Valladolid",264,{"$f":"VLOOKUP(A849,Municipios!$B$2:$B$223,1,FALSE)","v":"Logroño"}]
["Logroño","Toledo","Logroño-hasta-Toledo",454,{"$f":"VLOOKUP(A850,Municipios!$B$2:$B$223,1,FALSE)","v":"Logroño"}]
["Logroño","Tarragona","Logroño-hasta-Tarragona",442,{"$f":"VLOOKUP(A851,Municipios!$B$2:$B$223,1,FALSE)","v":"Logroño"}]
["Logroño","Soria","Logroño-hasta-Soria",100,{"$f":"VLOOKUP(A852,Municipios!$B$2:$B$223,1,FALSE)","v":"Logroño"}]
["Logroño","Sevilla","Logroño-hasta-Sevilla",861,{"$f":"VLOOKUP(A853,Municipios!$B$2:$B$223,1,FALSE)","v":"Logroño"}]
["Logroño","Segovia","Logroño-hasta-Segovia",295,{"$f":"VLOOKUP(A854,Municipios!$B$2:$B$223,1,FALSE)","v":"Logroño"}]
["Logroño","Madrid","Logroño-hasta-Madrid",369,{"$f":"VLOOKUP(A855,Municipios!$B$2:$B$223,1,FALSE)","v":"Logroño"}]
["Logroño","Lleida","Logroño-hasta-Lleida",332,{"$f":"VLOOKUP(A856,Municipios!$B$2:$B$223,1,FALSE)","v":"Logroño"}]
["Logroño","Valencia","Logroño-hasta-Valencia",551,{"$f":"VLOOKUP(A857,Municipios!$B$2:$B$223,1,FALSE)","v":"Logroño"}]
["Logroño","Santander","Logroño-hasta-Santander",293,{"$f":"VLOOKUP(A858,Municipios!$B$2:$B$223,1,FALSE)","v":"Logroño"}]
["Logroño","Murcia","Logroño-hasta-Murcia",714,{"$f":"VLOOKUP(A859,Municipios!$B$2:$B$223,1,FALSE)","v":"Logroño"}]
["Logroño","Oviedo","Logroño-hasta-Oviedo",446,{"$f":"VLOOKUP(A860,Municipios!$B$2:$B$223,1,FALSE)","v":"Logroño"}]
["Logroño","Lugo","Logroño-hasta-Lugo",550,{"$f":"VLOOKUP(A861,Municipios!$B$2:$B$223,1,FALSE)","v":"Logroño"}]
["Logroño","Palencia","Logroño-hasta-Palencia",243,{"$f":"VLOOKUP(A862,Municipios!$B$2:$B$223,1,FALSE)","v":"Logroño"}]
["Logroño","Pamplona/Iruña","Logroño-hasta-Pamplona/Iruña",93,{"$f":"VLOOKUP(A863,Municipios!$B$2:$B$223,1,FALSE)","v":"Logroño"}]
["Logroño","Pontevedra","Logroño-hasta-Pontevedra",571,{"$f":"VLOOKUP(A864,Municipios!$B$2:$B$223,1,FALSE)","v":"Logroño"}]
["Logroño","Salamanca","Logroño-hasta-Salamanca",381,{"$f":"VLOOKUP(A865,Municipios!$B$2:$B$223,1,FALSE)","v":"Logroño"}]
["Logroño","Donostia-San Sebastián","Logroño-hasta-Donostia-San Sebastián",206,{"$f":"VLOOKUP(A866,Municipios!$B$2:$B$223,1,FALSE)","v":"Logroño"}]
["Logroño","Ourense","Logroño-hasta-Ourense",478,{"$f":"VLOOKUP(A867,Municipios!$B$2:$B$223,1,FALSE)","v":"Logroño"}]
["Lugo","Soria","Lugo-hasta-Soria",568,{"$f":"VLOOKUP(A868,Municipios!$B$2:$B$223,1,FALSE)","v":"Lugo"}]
["Lugo","Valladolid","Lugo-hasta-Valladolid",355,{"$f":"VLOOKUP(A869,Municipios!$B$2:$B$223,1,FALSE)","v":"Lugo"}]
["Lugo","Teruel","Lugo-hasta-Teruel",806,{"$f":"VLOOKUP(A870,Municipios!$B$2:$B$223,1,FALSE)","v":"Lugo"}]
["Lugo","Valencia","Lugo-hasta-Valencia",868,{"$f":"VLOOKUP(A871,Municipios!$B$2:$B$223,1,FALSE)","v":"Lugo"}]
["Lugo","Vitoria/Gasteiz","Lugo-hasta-Vitoria/Gasteiz",517,{"$f":"VLOOKUP(A872,Municipios!$B$2:$B$223,1,FALSE)","v":"Lugo"}]
["Lugo","Zamora","Lugo-hasta-Zamora",304,{"$f":"VLOOKUP(A873,Municipios!$B$2:$B$223,1,FALSE)","v":"Lugo"}]
["Lugo","Zaragoza","Lugo-hasta-Zaragoza",721,{"$f":"VLOOKUP(A874,Municipios!$B$2:$B$223,1,FALSE)","v":"Lugo"}]
["Lugo","Murcia","Lugo-hasta-Murcia",909,{"$f":"VLOOKUP(A875,Municipios!$B$2:$B$223,1,FALSE)","v":"Lugo"}]
["Lugo","Sevilla","Lugo-hasta-Sevilla",836,{"$f":"VLOOKUP(A876,Municipios!$B$2:$B$223,1,FALSE)","v":"Lugo"}]
["Lugo","Tarragona","Lugo-hasta-Tarragona",987,{"$f":"VLOOKUP(A877,Municipios!$B$2:$B$223,1,FALSE)","v":"Lugo"}]
["Lugo","Ourense","Lugo-hasta-Ourense",88,{"$f":"VLOOKUP(A878,Municipios!$B$2:$B$223,1,FALSE)","v":"Lugo"}]
["Lugo","Oviedo","Lugo-hasta-Oviedo",233,{"$f":"VLOOKUP(A879,Municipios!$B$2:$B$223,1,FALSE)","v":"Lugo"}]
["Lugo","Toledo","Lugo-hasta-Toledo",578,{"$f":"VLOOKUP(A880,Municipios!$B$2:$B$223,1,FALSE)","v":"Lugo"}]
["Lugo","Segovia","Lugo-hasta-Segovia",455,{"$f":"VLOOKUP(A881,Municipios!$B$2:$B$223,1,FALSE)","v":"Lugo"}]
["Lugo","Lleida","Lugo-hasta-Lleida",899,{"$f":"VLOOKUP(A882,Municipios!$B$2:$B$223,1,FALSE)","v":"Lugo"}]
["Lugo","Madrid","Lugo-hasta-Madrid",502,{"$f":"VLOOKUP(A883,Municipios!$B$2:$B$223,1,FALSE)","v":"Lugo"}]
["Lugo","Palencia","Lugo-hasta-Palencia",343,{"$f":"VLOOKUP(A884,Municipios!$B$2:$B$223,1,FALSE)","v":"Lugo"}]
["Lugo","Pamplona/Iruña","Lugo-hasta-Pamplona/Iruña",607,{"$f":"VLOOKUP(A885,Municipios!$B$2:$B$223,1,FALSE)","v":"Lugo"}]
["Lugo","Pontevedra","Lugo-hasta-Pontevedra",146,{"$f":"VLOOKUP(A886,Municipios!$B$2:$B$223,1,FALSE)","v":"Lugo"}]
["Lugo","Salamanca","Lugo-hasta-Salamanca",369,{"$f":"VLOOKUP(A887,Municipios!$B$2:$B$223,1,FALSE)","v":"Lugo"}]
["Lugo","Donostia/San Sebastián","Lugo-hasta-Donostia/San Sebastián",634,{"$f":"VLOOKUP(A888,Municipios!$B$2:$B$223,1,FALSE)","v":"Lugo"}]
["Lugo","Santander","Lugo-hasta-Santander",426,{"$f":"VLOOKUP(A889,Municipios!$B$2:$B$223,1,FALSE)","v":"Lugo"}]
["Lugo","Málaga","Lugo-hasta-Málaga",1065,{"$f":"VLOOKUP(A890,Municipios!$B$2:$B$223,1,FALSE)","v":"Lugo"}]
["Lleida","Teruel","Lleida-hasta-Teruel",324,{"$f":"VLOOKUP(A891,Municipios!$B$2:$B$223,1,FALSE)","v":"Lleida"}]
["Lleida","Sevilla","Lleida-hasta-Sevilla",1007,{"$f":"VLOOKUP(A892,Municipios!$B$2:$B$223,1,FALSE)","v":"Lleida"}]
["Lleida","Soria","Lleida-hasta-Soria",305,{"$f":"VLOOKUP(A893,Municipios!$B$2:$B$223,1,FALSE)","v":"Lleida"}]
["Lleida","Tarragona","Lleida-hasta-Tarragona",136,{"$f":"VLOOKUP(A894,Municipios!$B$2:$B$223,1,FALSE)","v":"Lleida"}]
["Lleida","Toledo",{"$f":"CONCATENATE(A895,\"-hasta-\",B895)","v":"Lleida-hasta-Toledo"},550,{"$f":"VLOOKUP(A895,Municipios!$B$2:$B$223,1,FALSE)","v":"Lleida"}]
["Lleida","Valencia","Lleida-hasta-Valencia",386,{"$f":"VLOOKUP(A896,Municipios!$B$2:$B$223,1,FALSE)","v":"Lleida"}]
["Lleida","Valladolid","Lleida-hasta-Valladolid",614,{"$f":"VLOOKUP(A897,Municipios!$B$2:$B$223,1,FALSE)","v":"Lleida"}]
["Lleida","Vitoria/Gasteiz","Lleida-hasta-Vitoria/Gasteiz",400,{"$f":"VLOOKUP(A898,Municipios!$B$2:$B$223,1,FALSE)","v":"Lleida"}]
["Lleida","Zaragoza","Lleida-hasta-Zaragoza",140,{"$f":"VLOOKUP(A899,Municipios!$B$2:$B$223,1,FALSE)","v":"Lleida"}]
["Lleida","Donostia/San Sebastián","Lleida-hasta-Donostia/San Sebastián",405,{"$f":"VLOOKUP(A900,Municipios!$B$2:$B$223,1,FALSE)","v":"Lleida"}]
["Lleida","Zamora","Lleida-hasta-Zamora",608,{"$f":"VLOOKUP(A901,Municipios!$B$2:$B$223,1,FALSE)","v":"Lleida"}]
["Lleida","Madrid","Lleida-hasta-Madrid",452,{"$f":"VLOOKUP(A902,Municipios!$B$2:$B$223,1,FALSE)","v":"Lleida"}]
["Lleida","Salamanca","Lleida-hasta-Salamanca",734,{"$f":"VLOOKUP(A903,Municipios!$B$2:$B$223,1,FALSE)","v":"Lleida"}]
["Lleida","Pontevedra","Lleida-hasta-Pontevedra",921,{"$f":"VLOOKUP(A904,Municipios!$B$2:$B$223,1,FALSE)","v":"Lleida"}]
["Lleida","Pamplona/Iruña","Lleida-hasta-Pamplona/Iruña",315,{"$f":"VLOOKUP(A905,Municipios!$B$2:$B$223,1,FALSE)","v":"Lleida"}]
["Lleida","Palencia","Lleida-hasta-Palencia",592,{"$f":"VLOOKUP(A906,Municipios!$B$2:$B$223,1,FALSE)","v":"Lleida"}]
["Lleida","Oviedo","Lleida-hasta-Oviedo",796,{"$f":"VLOOKUP(A907,Municipios!$B$2:$B$223,1,FALSE)","v":"Lleida"}]
["Lleida","Ourense","Lleida-hasta-Ourense",827,{"$f":"VLOOKUP(A908,Municipios!$B$2:$B$223,1,FALSE)","v":"Lleida"}]
["Lleida","Murcia","Lleida-hasta-Murcia",645,{"$f":"VLOOKUP(A909,Municipios!$B$2:$B$223,1,FALSE)","v":"Lleida"}]
["Lleida","Málaga","Lleida-hasta-Málaga",1008,{"$f":"VLOOKUP(A910,Municipios!$B$2:$B$223,1,FALSE)","v":"Lleida"}]
["Lleida","Santander","Lleida-hasta-Santander",642,{"$f":"VLOOKUP(A911,Municipios!$B$2:$B$223,1,FALSE)","v":"Lleida"}]
["Lleida","Segovia","Lleida-hasta-Segovia",554,{"$f":"VLOOKUP(A912,Municipios!$B$2:$B$223,1,FALSE)","v":"Lleida"}]
["Madrid","Sevilla","Madrid-hasta-Sevilla",529,{"$f":"VLOOKUP(A913,Municipios!$B$2:$B$223,1,FALSE)","v":"Madrid"}]
["Madrid","Soria","Madrid-hasta-Soria",221,{"$f":"VLOOKUP(A914,Municipios!$B$2:$B$223,1,FALSE)","v":"Madrid"}]
["Madrid","Tarragona","Madrid-hasta-Tarragona",576,{"$f":"VLOOKUP(A915,Municipios!$B$2:$B$223,1,FALSE)","v":"Madrid"}]
["Madrid","Teruel","Madrid-hasta-Teruel",292,{"$f":"VLOOKUP(A916,Municipios!$B$2:$B$223,1,FALSE)","v":"Madrid"}]
["Madrid","Toledo","Madrid-hasta-Toledo",68,{"$f":"VLOOKUP(A917,Municipios!$B$2:$B$223,1,FALSE)","v":"Madrid"}]
["Madrid","Valladolid","Madrid-hasta-Valladolid",211,{"$f":"VLOOKUP(A918,Municipios!$B$2:$B$223,1,FALSE)","v":"Madrid"}]
["Madrid","Zamora","Madrid-hasta-Zamora",249,{"$f":"VLOOKUP(A919,Municipios!$B$2:$B$223,1,FALSE)","v":"Madrid"}]
["Madrid","Zaragoza","Madrid-hasta-Zaragoza",312,{"$f":"VLOOKUP(A920,Municipios!$B$2:$B$223,1,FALSE)","v":"Madrid"}]
["Madrid","Valencia","Madrid-hasta-Valencia",347,{"$f":"VLOOKUP(A921,Municipios!$B$2:$B$223,1,FALSE)","v":"Madrid"}]
["Madrid","Segovia","Madrid-hasta-Segovia",90,{"$f":"VLOOKUP(A922,Municipios!$B$2:$B$223,1,FALSE)","v":"Madrid"}]
["Madrid","Ourense","Madrid-hasta-Ourense",490,{"$f":"VLOOKUP(A923,Municipios!$B$2:$B$223,1,FALSE)","v":"Madrid"}]
["Madrid","Murcia","Madrid-hasta-Murcia",388,{"$f":"VLOOKUP(A924,Municipios!$B$2:$B$223,1,FALSE)","v":"Madrid"}]
["Madrid","Málaga","Madrid-hasta-Málaga",550,{"$f":"VLOOKUP(A925,Municipios!$B$2:$B$223,1,FALSE)","v":"Madrid"}]
["Madrid","Oviedo","Madrid-hasta-Oviedo",434,{"$f":"VLOOKUP(A926,Municipios!$B$2:$B$223,1,FALSE)","v":"Madrid"}]
["Madrid","Vitoria/Gasteiz","Madrid-hasta-Vitoria/Gasteiz",334,{"$f":"VLOOKUP(A927,Municipios!$B$2:$B$223,1,FALSE)","v":"Madrid"}]
["Madrid","Palencia","Madrid-hasta-Palencia",259,{"$f":"VLOOKUP(A928,Municipios!$B$2:$B$223,1,FALSE)","v":"Madrid"}]
["Madrid","Pamplona/Iruña","Madrid-hasta-Pamplona/Iruña",424,{"$f":"VLOOKUP(A929,Municipios!$B$2:$B$223,1,FALSE)","v":"Madrid"}]
["Madrid","Pontevedra","Madrid-hasta-Pontevedra",584,{"$f":"VLOOKUP(A930,Municipios!$B$2:$B$223,1,FALSE)","v":"Madrid"}]
["Madrid","Salamanca","Madrid-hasta-Salamanca",204,{"$f":"VLOOKUP(A931,Municipios!$B$2:$B$223,1,FALSE)","v":"Madrid"}]
["Madrid","Donostia/San Sebastián","Madrid-hasta-Donostia/San Sebastián",451,{"$f":"VLOOKUP(A932,Municipios!$B$2:$B$223,1,FALSE)","v":"Madrid"}]
["Madrid","Santander","Madrid-hasta-Santander",388,{"$f":"VLOOKUP(A933,Municipios!$B$2:$B$223,1,FALSE)","v":"Madrid"}]
["Málaga","Vitoria/Gasteiz","Málaga-hasta-Vitoria/Gasteiz",901,{"$f":"VLOOKUP(A934,Municipios!$B$2:$B$223,1,FALSE)","v":"Málaga"}]
["Málaga","Sevilla","Málaga-hasta-Sevilla",200,{"$f":"VLOOKUP(A935,Municipios!$B$2:$B$223,1,FALSE)","v":"Málaga"}]
["Málaga","Zamora","Málaga-hasta-Zamora",738,{"$f":"VLOOKUP(A936,Municipios!$B$2:$B$223,1,FALSE)","v":"Málaga"}]
["Málaga","Valladolid","Málaga-hasta-Valladolid",767,{"$f":"VLOOKUP(A937,Municipios!$B$2:$B$223,1,FALSE)","v":"Málaga"}]
["Málaga","Valencia","Málaga-hasta-Valencia",663,{"$f":"VLOOKUP(A938,Municipios!$B$2:$B$223,1,FALSE)","v":"Málaga"}]
["Málaga","Toledo","Málaga-hasta-Toledo",466,{"$f":"VLOOKUP(A939,Municipios!$B$2:$B$223,1,FALSE)","v":"Málaga"}]
["Málaga","Teruel","Málaga-hasta-Teruel",752,{"$f":"VLOOKUP(A940,Municipios!$B$2:$B$223,1,FALSE)","v":"Málaga"}]
["Málaga","Tarragona","Málaga-hasta-Tarragona",920,{"$f":"VLOOKUP(A941,Municipios!$B$2:$B$223,1,FALSE)","v":"Málaga"}]
["Málaga","Soria","Málaga-hasta-Soria",777,{"$f":"VLOOKUP(A942,Municipios!$B$2:$B$223,1,FALSE)","v":"Málaga"}]
["Málaga","Ourense","Málaga-hasta-Ourense",1030,{"$f":"VLOOKUP(A943,Municipios!$B$2:$B$223,1,FALSE)","v":"Málaga"}]
["Málaga","Segovia","Málaga-hasta-Segovia",653,{"$f":"VLOOKUP(A944,Municipios!$B$2:$B$223,1,FALSE)","v":"Málaga"}]
["Málaga","Zaragoza","Málaga-hasta-Zaragoza",868,{"$f":"VLOOKUP(A945,Municipios!$B$2:$B$223,1,FALSE)","v":"Málaga"}]
["Málaga","Murcia","Málaga-hasta-Murcia",403,{"$f":"VLOOKUP(A946,Municipios!$B$2:$B$223,1,FALSE)","v":"Málaga"}]
["Málaga","Oviedo","Málaga-hasta-Oviedo",992,{"$f":"VLOOKUP(A947,Municipios!$B$2:$B$223,1,FALSE)","v":"Málaga"}]
["Málaga","Palencia","Málaga-hasta-Palencia",835,{"$f":"VLOOKUP(A948,Municipios!$B$2:$B$223,1,FALSE)","v":"Málaga"}]
["Málaga","Pamplona/Iruña","Málaga-hasta-Pamplona/Iruña",974,{"$f":"VLOOKUP(A949,Municipios!$B$2:$B$223,1,FALSE)","v":"Málaga"}]
["Málaga","Pontevedra","Málaga-hasta-Pontevedra",1119,{"$f":"VLOOKUP(A950,Municipios!$B$2:$B$223,1,FALSE)","v":"Málaga"}]
["Málaga","Salamanca","Málaga-hasta-Salamanca",673,{"$f":"VLOOKUP(A951,Municipios!$B$2:$B$223,1,FALSE)","v":"Málaga"}]
["Málaga","Donostia/San Sebastián","Málaga-hasta-Donostia/San Sebastián",1018,{"$f":"VLOOKUP(A952,Municipios!$B$2:$B$223,1,FALSE)","v":"Málaga"}]
["Málaga","Santander","Málaga-hasta-Santander",955,{"$f":"VLOOKUP(A953,Municipios!$B$2:$B$223,1,FALSE)","v":"Málaga"}]
["Murcia","Zamora","Murcia-hasta-Zamora",665,{"$f":"VLOOKUP(A954,Municipios!$B$2:$B$223,1,FALSE)","v":"Murcia"}]
["Murcia","Santander","Murcia-hasta-Santander",790,{"$f":"VLOOKUP(A955,Municipios!$B$2:$B$223,1,FALSE)","v":"Murcia"}]
["Murcia","Vitoria/Gasteiz","Murcia-hasta-Vitoria/Gasteiz",736,{"$f":"VLOOKUP(A956,Municipios!$B$2:$B$223,1,FALSE)","v":"Murcia"}]
["Murcia","Valladolid","Murcia-hasta-Valladolid",617,{"$f":"VLOOKUP(A957,Municipios!$B$2:$B$223,1,FALSE)","v":"Murcia"}]
["Murcia","Valencia","Murcia-hasta-Valencia",259,{"$f":"VLOOKUP(A958,Municipios!$B$2:$B$223,1,FALSE)","v":"Murcia"}]
["Murcia","Toledo",{"$f":"CONCATENATE(A959,\"-hasta-\",B959)","v":"Murcia-hasta-Toledo"},432,{"$f":"VLOOKUP(A959,Municipios!$B$2:$B$223,1,FALSE)","v":"Murcia"}]
["Murcia","Teruel","Murcia-hasta-Teruel",384,{"$f":"VLOOKUP(A960,Municipios!$B$2:$B$223,1,FALSE)","v":"Murcia"}]
["Murcia","Tarragona","Murcia-hasta-Tarragona",517,{"$f":"VLOOKUP(A961,Municipios!$B$2:$B$223,1,FALSE)","v":"Murcia"}]
["Murcia","Soria","Murcia-hasta-Soria",554,{"$f":"VLOOKUP(A962,Municipios!$B$2:$B$223,1,FALSE)","v":"Murcia"}]
["Murcia","Zaragoza","Murcia-hasta-Zaragoza",548,{"$f":"VLOOKUP(A963,Municipios!$B$2:$B$223,1,FALSE)","v":"Murcia"}]
["Murcia","Pamplona/Iruña","Murcia-hasta-Pamplona/Iruña",723,{"$f":"VLOOKUP(A964,Municipios!$B$2:$B$223,1,FALSE)","v":"Murcia"}]
["Murcia","Ourense","Murcia-hasta-Ourense",897,{"$f":"VLOOKUP(A965,Municipios!$B$2:$B$223,1,FALSE)","v":"Murcia"}]
["Murcia","Sevilla","Murcia-hasta-Sevilla",591,{"$f":"VLOOKUP(A966,Municipios!$B$2:$B$223,1,FALSE)","v":"Murcia"}]
["Murcia","Palencia","Murcia-hasta-Palencia",665,{"$f":"VLOOKUP(A967,Municipios!$B$2:$B$223,1,FALSE)","v":"Murcia"}]
["Murcia","Segovia","Murcia-hasta-Segovia",506,{"$f":"VLOOKUP(A968,Municipios!$B$2:$B$223,1,FALSE)","v":"Murcia"}]
["Murcia","Pontevedra","Murcia-hasta-Pontevedra",1002,{"$f":"VLOOKUP(A969,Municipios!$B$2:$B$223,1,FALSE)","v":"Murcia"}]
["Murcia","Salamanca","Murcia-hasta-Salamanca",619,{"$f":"VLOOKUP(A970,Municipios!$B$2:$B$223,1,FALSE)","v":"Murcia"}]
["Murcia","Donostia/San Sebastián","Murcia-hasta-Donostia/San Sebastián",813,{"$f":"VLOOKUP(A971,Municipios!$B$2:$B$223,1,FALSE)","v":"Murcia"}]
["Murcia","Oviedo","Murcia-hasta-Oviedo",849,{"$f":"VLOOKUP(A972,Municipios!$B$2:$B$223,1,FALSE)","v":"Murcia"}]
["Ourense","Zamora","Ourense-hasta-Zamora",296,{"$f":"VLOOKUP(A973,Municipios!$B$2:$B$223,1,FALSE)","v":"Ourense"}]
["Ourense","Vitoria/Gasteiz","Ourense-hasta-Vitoria/Gasteiz",445,{"$f":"VLOOKUP(A974,Municipios!$B$2:$B$223,1,FALSE)","v":"Ourense"}]
["Ourense","Zaragoza","Ourense-hasta-Zaragoza",649,{"$f":"VLOOKUP(A975,Municipios!$B$2:$B$223,1,FALSE)","v":"Ourense"}]
["Ourense","Valencia","Ourense-hasta-Valencia",856,{"$f":"VLOOKUP(A976,Municipios!$B$2:$B$223,1,FALSE)","v":"Ourense"}]
["Ourense","Toledo","Ourense-hasta-Toledo",566,{"$f":"VLOOKUP(A977,Municipios!$B$2:$B$223,1,FALSE)","v":"Ourense"}]
["Ourense","Teruel","Ourense-hasta-Teruel",831,{"$f":"VLOOKUP(A978,Municipios!$B$2:$B$223,1,FALSE)","v":"Ourense"}]
["Ourense","Segovia","Ourense-hasta-Segovia",447,{"$f":"VLOOKUP(A979,Municipios!$B$2:$B$223,1,FALSE)","v":"Ourense"}]
["Ourense","Soria","Ourense-hasta-Soria",553,{"$f":"VLOOKUP(A980,Municipios!$B$2:$B$223,1,FALSE)","v":"Ourense"}]
["Ourense","Santander","Ourense-hasta-Santander",604,{"$f":"VLOOKUP(A981,Municipios!$B$2:$B$223,1,FALSE)","v":"Ourense"}]
["Ourense","Donostia/San Sebastián","Ourense-hasta-Donostia/San Sebastián",562,{"$f":"VLOOKUP(A982,Municipios!$B$2:$B$223,1,FALSE)","v":"Ourense"}]
["Ourense","Salamanca","Ourense-hasta-Salamanca",361,{"$f":"VLOOKUP(A983,Municipios!$B$2:$B$223,1,FALSE)","v":"Ourense"}]
["Ourense","Pamplona/Iruña","Ourense-hasta-Pamplona/Iruña",535,{"$f":"VLOOKUP(A984,Municipios!$B$2:$B$223,1,FALSE)","v":"Ourense"}]
["Ourense","Palencia","Ourense-hasta-Palencia",333,{"$f":"VLOOKUP(A985,Municipios!$B$2:$B$223,1,FALSE)","v":"Ourense"}]
["Ourense","Oviedo","Ourense-hasta-Oviedo",379,{"$f":"VLOOKUP(A986,Municipios!$B$2:$B$223,1,FALSE)","v":"Ourense"}]
["Ourense","Pontevedra","Ourense-hasta-Pontevedra",94,{"$f":"VLOOKUP(A987,Municipios!$B$2:$B$223,1,FALSE)","v":"Ourense"}]
["Ourense","Sevilla","Ourense-hasta-Sevilla",831,{"$f":"VLOOKUP(A988,Municipios!$B$2:$B$223,1,FALSE)","v":"Ourense"}]
["Ourense","Valladolid","Ourense-hasta-Valladolid",340,{"$f":"VLOOKUP(A989,Municipios!$B$2:$B$223,1,FALSE)","v":"Ourense"}]
["Ourense","Tarragona","Ourense-hasta-Tarragona",915,{"$f":"VLOOKUP(A990,Municipios!$B$2:$B$223,1,FALSE)","v":"Ourense"}]
["Almería","Ávila","Almería-hasta-Ávila",741,{"$f":"VLOOKUP(A991,Municipios!$B$2:$B$223,1,FALSE)","v":"Almería"}]
["Almería","Soria","Almería-hasta-Soria",760,{"$f":"VLOOKUP(A992,Municipios!$B$2:$B$223,1,FALSE)","v":"Almería"}]
["Almería","Sevilla","Almería-hasta-Sevilla",410,{"$f":"VLOOKUP(A993,Municipios!$B$2:$B$223,1,FALSE)","v":"Almería"}]
["Almería","Segovia","Almería-hasta-Segovia",721,{"$f":"VLOOKUP(A994,Municipios!$B$2:$B$223,1,FALSE)","v":"Almería"}]
["Almería","Santander","Almería-hasta-Santander",1005,{"$f":"VLOOKUP(A995,Municipios!$B$2:$B$223,1,FALSE)","v":"Almería"}]
["Almería","Donostia/San Sebastián","Almería-hasta-Donostia/San Sebastián",1055,{"$f":"VLOOKUP(A996,Municipios!$B$2:$B$223,1,FALSE)","v":"Almería"}]
["Almería","Tarragona","Almería-hasta-Tarragona",728,{"$f":"VLOOKUP(A997,Municipios!$B$2:$B$223,1,FALSE)","v":"Almería"}]
["Almería","Pontevedra","Almería-hasta-Pontevedra",1214,{"$f":"VLOOKUP(A998,Municipios!$B$2:$B$223,1,FALSE)","v":"Almería"}]
["Almería","Zamora","Almería-hasta-Zamora",880,{"$f":"VLOOKUP(A999,Municipios!$B$2:$B$223,1,FALSE)","v":"Almería"}]
["Almería","Salamanca","Almería-hasta-Salamanca",835,{"$f":"VLOOKUP(A1000,Municipios!$B$2:$B$223,1,FALSE)","v":"Almería"}]
["Almería","Teruel","Almería-hasta-Teruel",608,{"$f":"VLOOKUP(A1001,Municipios!$B$2:$B$223,1,FALSE)","v":"Almería"}]
["Almería","Toledo","Almería-hasta-Toledo",643,{"$f":"VLOOKUP(A1002,Municipios!$B$2:$B$223,1,FALSE)","v":"Almería"}]
["Almería","Valencia","Almería-hasta-Valencia",476,{"$f":"VLOOKUP(A1003,Municipios!$B$2:$B$223,1,FALSE)","v":"Almería"}]
["Almería","Vitoria/Gasteiz","Almería-hasta-Vitoria/Gasteiz",955,{"$f":"VLOOKUP(A1004,Municipios!$B$2:$B$223,1,FALSE)","v":"Almería"}]
["Almería","Oviedo","Almería-hasta-Oviedo",1064,{"$f":"VLOOKUP(A1005,Municipios!$B$2:$B$223,1,FALSE)","v":"Almería"}]
["Almería","Zaragoza","Almería-hasta-Zaragoza",805,{"$f":"VLOOKUP(A1006,Municipios!$B$2:$B$223,1,FALSE)","v":"Almería"}]
["Almería","Badajoz","Almería-hasta-Badajoz",671,{"$f":"VLOOKUP(A1007,Municipios!$B$2:$B$223,1,FALSE)","v":"Almería"}]
["Almería","Barcelona","Almería-hasta-Barcelona",826,{"$f":"VLOOKUP(A1008,Municipios!$B$2:$B$223,1,FALSE)","v":"Almería"}]
["Almería","Bilbao","Almería-hasta-Bilbao",974,{"$f":"VLOOKUP(A1009,Municipios!$B$2:$B$223,1,FALSE)","v":"Almería"}]
["Almería","Burgos","Almería-hasta-Burgos",830,{"$f":"VLOOKUP(A1010,Municipios!$B$2:$B$223,1,FALSE)","v":"Almería"}]
["Almería","Cáceres","Almería-hasta-Cáceres",671,{"$f":"VLOOKUP(A1011,Municipios!$B$2:$B$223,1,FALSE)","v":"Almería"}]
["Almería","Valladolid","Almería-hasta-Valladolid",829,{"$f":"VLOOKUP(A1012,Municipios!$B$2:$B$223,1,FALSE)","v":"Almería"}]
["Almería","Granada","Almería-hasta-Granada",185,{"$f":"VLOOKUP(A1013,Municipios!$B$2:$B$223,1,FALSE)","v":"Almería"}]
["Almería","Cádiz","Almería-hasta-Cádiz",475,{"$f":"VLOOKUP(A1014,Municipios!$B$2:$B$223,1,FALSE)","v":"Almería"}]
["Almería","Castellón de la Plana/Castelló de la Plana","Almería-hasta-Castellón de la Plana/Castelló de la Plana",543,{"$f":"VLOOKUP(A1015,Municipios!$B$2:$B$223,1,FALSE)","v":"Almería"}]
["Almería","Ciudad Real","Almería-hasta-Ciudad Real",494,{"$f":"VLOOKUP(A1016,Municipios!$B$2:$B$223,1,FALSE)","v":"Almería"}]
["Almería","Córdoba","Almería-hasta-Córdoba",374,{"$f":"VLOOKUP(A1017,Municipios!$B$2:$B$223,1,FALSE)","v":"Almería"}]
["Almería","Coruña (A)","Almería-hasta-Coruña (A)",1301,{"$f":"VLOOKUP(A1018,Municipios!$B$2:$B$223,1,FALSE)","v":"Almería"}]
["Almería","Pamplona/Iruña","Almería-hasta-Pamplona/Iruña",980,{"$f":"VLOOKUP(A1019,Municipios!$B$2:$B$223,1,FALSE)","v":"Almería"}]
["Almería","Girona","Almería-hasta-Girona",909,{"$f":"VLOOKUP(A1020,Municipios!$B$2:$B$223,1,FALSE)","v":"Almería"}]
["Almería","Palencia","Almería-hasta-Palencia",863,{"$f":"VLOOKUP(A1021,Municipios!$B$2:$B$223,1,FALSE)","v":"Almería"}]
["Almería","Guadalajara","Almería-hasta-Guadalajara",651,{"$f":"VLOOKUP(A1022,Municipios!$B$2:$B$223,1,FALSE)","v":"Almería"}]
["Almería","Huelva",{"$f":"CONCATENATE(A1023,\"-hasta-\",B1023)","v":"Almería-hasta-Huelva"},495,{"$f":"VLOOKUP(A1023,Municipios!$B$2:$B$223,1,FALSE)","v":"Almería"}]
["Almería","Murcia","Almería-hasta-Murcia",212,{"$f":"VLOOKUP(A1024,Municipios!$B$2:$B$223,1,FALSE)","v":"Almería"}]
["Almería","Cuenca","Almería-hasta-Cuenca",490,{"$f":"VLOOKUP(A1025,Municipios!$B$2:$B$223,1,FALSE)","v":"Almería"}]
["Almería","Ourense","Almería-hasta-Ourense",1117,{"$f":"VLOOKUP(A1026,Municipios!$B$2:$B$223,1,FALSE)","v":"Almería"}]
["Almería","Huesca","Almería-hasta-Huesca",878,{"$f":"VLOOKUP(A1027,Municipios!$B$2:$B$223,1,FALSE)","v":"Almería"}]
["Almería","Málaga","Almería-hasta-Málaga",204,{"$f":"VLOOKUP(A1028,Municipios!$B$2:$B$223,1,FALSE)","v":"Almería"}]
["Almería","Madrid","Almería-hasta-Madrid",604,{"$f":"VLOOKUP(A1029,Municipios!$B$2:$B$223,1,FALSE)","v":"Almería"}]
["Almería","Lleida","Almería-hasta-Lleida",919,{"$f":"VLOOKUP(A1030,Municipios!$B$2:$B$223,1,FALSE)","v":"Almería"}]
["Almería","Lugo","Almería-hasta-Lugo",1106,{"$f":"VLOOKUP(A1031,Municipios!$B$2:$B$223,1,FALSE)","v":"Almería"}]
["Almería","Logroño","Almería-hasta-Logroño",973,{"$f":"VLOOKUP(A1032,Municipios!$B$2:$B$223,1,FALSE)","v":"Almería"}]
["Almería","León","Almería-hasta-León",967,{"$f":"VLOOKUP(A1033,Municipios!$B$2:$B$223,1,FALSE)","v":"Almería"}]
["Almería","Jaén","Almería-hasta-Jaén",280,{"$f":"VLOOKUP(A1034,Municipios!$B$2:$B$223,1,FALSE)","v":"Almería"}]
["Oviedo","Toledo","Oviedo-hasta-Toledo",512,{"$f":"VLOOKUP(A1035,Municipios!$B$2:$B$223,1,FALSE)","v":"Oviedo"}]
["Oviedo","Zaragoza","Oviedo-hasta-Zaragoza",621,{"$f":"VLOOKUP(A1036,Municipios!$B$2:$B$223,1,FALSE)","v":"Oviedo"}]
["Oviedo","Zamora","Oviedo-hasta-Zamora",259,{"$f":"VLOOKUP(A1037,Municipios!$B$2:$B$223,1,FALSE)","v":"Oviedo"}]
["Oviedo","Vitoria/Gasteiz","Oviedo-hasta-Vitoria/Gasteiz",360,{"$f":"VLOOKUP(A1038,Municipios!$B$2:$B$223,1,FALSE)","v":"Oviedo"}]
["Oviedo","Valencia","Oviedo-hasta-Valencia",808,{"$f":"VLOOKUP(A1039,Municipios!$B$2:$B$223,1,FALSE)","v":"Oviedo"}]
["Oviedo","Teruel","Oviedo-hasta-Teruel",678,{"$f":"VLOOKUP(A1040,Municipios!$B$2:$B$223,1,FALSE)","v":"Oviedo"}]
["Oviedo","Tarragona","Oviedo-hasta-Tarragona",883,{"$f":"VLOOKUP(A1041,Municipios!$B$2:$B$223,1,FALSE)","v":"Oviedo"}]
["Oviedo","Salamanca","Oviedo-hasta-Salamanca",321,{"$f":"VLOOKUP(A1042,Municipios!$B$2:$B$223,1,FALSE)","v":"Oviedo"}]
["Oviedo","Palencia","Oviedo-hasta-Palencia",245,{"$f":"VLOOKUP(A1043,Municipios!$B$2:$B$223,1,FALSE)","v":"Oviedo"}]
["Oviedo","Pontevedra","Oviedo-hasta-Pontevedra",384,{"$f":"VLOOKUP(A1044,Municipios!$B$2:$B$223,1,FALSE)","v":"Oviedo"}]
["Oviedo","Donostia/San Sebastián","Oviedo-hasta-Donostia/San Sebastián",398,{"$f":"VLOOKUP(A1045,Municipios!$B$2:$B$223,1,FALSE)","v":"Oviedo"}]
["Oviedo","Valladolid","Oviedo-hasta-Valladolid",256,{"$f":"VLOOKUP(A1046,Municipios!$B$2:$B$223,1,FALSE)","v":"Oviedo"}]
["Oviedo","Santander","Oviedo-hasta-Santander",193,{"$f":"VLOOKUP(A1047,Municipios!$B$2:$B$223,1,FALSE)","v":"Oviedo"}]
["Oviedo","Soria","Oviedo-hasta-Soria",456,{"$f":"VLOOKUP(A1048,Municipios!$B$2:$B$223,1,FALSE)","v":"Oviedo"}]
["Oviedo","Segovia","Oviedo-hasta-Segovia",398,{"$f":"VLOOKUP(A1049,Municipios!$B$2:$B$223,1,FALSE)","v":"Oviedo"}]
["Oviedo","Sevilla","Oviedo-hasta-Sevilla",788,{"$f":"VLOOKUP(A1050,Municipios!$B$2:$B$223,1,FALSE)","v":"Oviedo"}]
["Oviedo","Pamplona/Iruña","Oviedo-hasta-Pamplona/Iruña",450,{"$f":"VLOOKUP(A1051,Municipios!$B$2:$B$223,1,FALSE)","v":"Oviedo"}]
["Palencia","Vitoria/Gasteiz","Palencia-hasta-Vitoria/Gasteiz",208,{"$f":"VLOOKUP(A1052,Municipios!$B$2:$B$223,1,FALSE)","v":"Palencia"}]
["Palencia","Tarragona","Palencia-hasta-Tarragona",687,{"$f":"VLOOKUP(A1053,Municipios!$B$2:$B$223,1,FALSE)","v":"Palencia"}]
["Palencia","Zamora","Palencia-hasta-Zamora",157,{"$f":"VLOOKUP(A1054,Municipios!$B$2:$B$223,1,FALSE)","v":"Palencia"}]
["Palencia","Valladolid","Palencia-hasta-Valladolid",51,{"$f":"VLOOKUP(A1055,Municipios!$B$2:$B$223,1,FALSE)","v":"Palencia"}]
["Palencia","Valencia","Palencia-hasta-Valencia",624,{"$f":"VLOOKUP(A1056,Municipios!$B$2:$B$223,1,FALSE)","v":"Palencia"}]
["Palencia","Toledo","Palencia-hasta-Toledo",340,{"$f":"VLOOKUP(A1057,Municipios!$B$2:$B$223,1,FALSE)","v":"Palencia"}]
["Palencia","Teruel","Palencia-hasta-Teruel",449,{"$f":"VLOOKUP(A1058,Municipios!$B$2:$B$223,1,FALSE)","v":"Palencia"}]
["Palencia","Pontevedra","Palencia-hasta-Pontevedra",492,{"$f":"VLOOKUP(A1059,Municipios!$B$2:$B$223,1,FALSE)","v":"Palencia"}]
["Palencia","Sevilla","Palencia-hasta-Sevilla",680,{"$f":"VLOOKUP(A1060,Municipios!$B$2:$B$223,1,FALSE)","v":"Palencia"}]
["Palencia","Segovia","Palencia-hasta-Segovia",210,{"$f":"VLOOKUP(A1061,Municipios!$B$2:$B$223,1,FALSE)","v":"Palencia"}]
["Palencia","Santander","Palencia-hasta-Santander",194,{"$f":"VLOOKUP(A1062,Municipios!$B$2:$B$223,1,FALSE)","v":"Palencia"}]
["Palencia","Donostia/San Sebastián","Palencia-hasta-Donostia/San Sebastián",325,{"$f":"VLOOKUP(A1063,Municipios!$B$2:$B$223,1,FALSE)","v":"Palencia"}]
["Palencia","Pamplona/Iruña","Palencia-hasta-Pamplona/Iruña",298,{"$f":"VLOOKUP(A1064,Municipios!$B$2:$B$223,1,FALSE)","v":"Palencia"}]
["Palencia","Salamanca","Palencia-hasta-Salamanca",163,{"$f":"VLOOKUP(A1065,Municipios!$B$2:$B$223,1,FALSE)","v":"Palencia"}]
["Palencia","Soria","Palencia-hasta-Soria",226,{"$f":"VLOOKUP(A1066,Municipios!$B$2:$B$223,1,FALSE)","v":"Palencia"}]
["Palencia","Zaragoza","Palencia-hasta-Zaragoza",414,{"$f":"VLOOKUP(A1067,Municipios!$B$2:$B$223,1,FALSE)","v":"Palencia"}]
["Pamplona/Iruña","Toledo","Pamplona/Iruña-hasta-Toledo",511,{"$f":"VLOOKUP(A1068,Municipios!$B$2:$B$223,1,FALSE)","v":"Pamplona/Iruña"}]
["Pamplona/Iruña","Valencia","Pamplona/Iruña-hasta-Valencia",555,{"$f":"VLOOKUP(A1069,Municipios!$B$2:$B$223,1,FALSE)","v":"Pamplona/Iruña"}]
["Pamplona/Iruña","Valladolid","Pamplona/Iruña-hasta-Valladolid",319,{"$f":"VLOOKUP(A1070,Municipios!$B$2:$B$223,1,FALSE)","v":"Pamplona/Iruña"}]
["Pamplona/Iruña","Vitoria/Gasteiz","Pamplona/Iruña-hasta-Vitoria/Gasteiz",90,{"$f":"VLOOKUP(A1071,Municipios!$B$2:$B$223,1,FALSE)","v":"Pamplona/Iruña"}]
["Pamplona/Iruña","Zaragoza","Pamplona/Iruña-hasta-Zaragoza",175,{"$f":"VLOOKUP(A1072,Municipios!$B$2:$B$223,1,FALSE)","v":"Pamplona/Iruña"}]
["Pamplona/Iruña","Soria","Pamplona/Iruña-hasta-Soria",184,{"$f":"VLOOKUP(A1073,Municipios!$B$2:$B$223,1,FALSE)","v":"Pamplona/Iruña"}]
["Pamplona/Iruña","Zamora","Pamplona/Iruña-hasta-Zamora",409,{"$f":"VLOOKUP(A1074,Municipios!$B$2:$B$223,1,FALSE)","v":"Pamplona/Iruña"}]
["Pamplona/Iruña","Tarragona","Pamplona/Iruña-hasta-Tarragona",448,{"$f":"VLOOKUP(A1075,Municipios!$B$2:$B$223,1,FALSE)","v":"Pamplona/Iruña"}]
["Pamplona/Iruña","Sevilla","Pamplona/Iruña-hasta-Sevilla",969,{"$f":"VLOOKUP(A1076,Municipios!$B$2:$B$223,1,FALSE)","v":"Pamplona/Iruña"}]
["Pamplona/Iruña","Segovia","Pamplona/Iruña-hasta-Segovia",395,{"$f":"VLOOKUP(A1077,Municipios!$B$2:$B$223,1,FALSE)","v":"Pamplona/Iruña"}]
["Pamplona/Iruña","Santander","Pamplona/Iruña-hasta-Santander",295,{"$f":"VLOOKUP(A1078,Municipios!$B$2:$B$223,1,FALSE)","v":"Pamplona/Iruña"}]
["Pamplona/Iruña","Donostia/San Sebastián","Pamplona/Iruña-hasta-Donostia/San Sebastián",90,{"$f":"VLOOKUP(A1079,Municipios!$B$2:$B$223,1,FALSE)","v":"Pamplona/Iruña"}]
["Pamplona/Iruña","Salamanca","Pamplona/Iruña-hasta-Salamanca",440,{"$f":"VLOOKUP(A1080,Municipios!$B$2:$B$223,1,FALSE)","v":"Pamplona/Iruña"}]
["Pamplona/Iruña","Pontevedra","Pamplona/Iruña-hasta-Pontevedra",629,{"$f":"VLOOKUP(A1081,Municipios!$B$2:$B$223,1,FALSE)","v":"Pamplona/Iruña"}]
["Pamplona/Iruña","Teruel","Pamplona/Iruña-hasta-Teruel",356,{"$f":"VLOOKUP(A1082,Municipios!$B$2:$B$223,1,FALSE)","v":"Pamplona/Iruña"}]
["Pontevedra","Valencia","Pontevedra-hasta-Valencia",961,{"$f":"VLOOKUP(A1083,Municipios!$B$2:$B$223,1,FALSE)","v":"Pontevedra"}]
["Pontevedra","Tarragona","Pontevedra-hasta-Tarragona",1009,{"$f":"VLOOKUP(A1084,Municipios!$B$2:$B$223,1,FALSE)","v":"Pontevedra"}]
["Pontevedra","Zaragoza","Pontevedra-hasta-Zaragoza",743,{"$f":"VLOOKUP(A1085,Municipios!$B$2:$B$223,1,FALSE)","v":"Pontevedra"}]
["Pontevedra","Zamora","Pontevedra-hasta-Zamora",390,{"$f":"VLOOKUP(A1086,Municipios!$B$2:$B$223,1,FALSE)","v":"Pontevedra"}]
["Pontevedra","Vitoria/Gasteiz",{"$f":"CONCATENATE(A1087,\"-hasta-\",B1087)","v":"Pontevedra-hasta-Vitoria/Gasteiz"},539,{"$f":"VLOOKUP(A1087,Municipios!$B$2:$B$223,1,FALSE)","v":"Pontevedra"}]
["Pontevedra","Valladolid","Pontevedra-hasta-Valladolid",445,{"$f":"VLOOKUP(A1088,Municipios!$B$2:$B$223,1,FALSE)","v":"Pontevedra"}]
["Pontevedra","Salamanca","Pontevedra-hasta-Salamanca",455,{"$f":"VLOOKUP(A1089,Municipios!$B$2:$B$223,1,FALSE)","v":"Pontevedra"}]
["Pontevedra","Donostia/San Sebastián","Pontevedra-hasta-Donostia/San Sebastián",656,{"$f":"VLOOKUP(A1090,Municipios!$B$2:$B$223,1,FALSE)","v":"Pontevedra"}]
["Pontevedra","Soria","Pontevedra-hasta-Soria",646,{"$f":"VLOOKUP(A1091,Municipios!$B$2:$B$223,1,FALSE)","v":"Pontevedra"}]
["Pontevedra","Sevilla","Pontevedra-hasta-Sevilla",924,{"$f":"VLOOKUP(A1092,Municipios!$B$2:$B$223,1,FALSE)","v":"Pontevedra"}]
["Pontevedra","Segovia","Pontevedra-hasta-Segovia",540,{"$f":"VLOOKUP(A1093,Municipios!$B$2:$B$223,1,FALSE)","v":"Pontevedra"}]
["Pontevedra","Santander","Pontevedra-hasta-Santander",698,{"$f":"VLOOKUP(A1094,Municipios!$B$2:$B$223,1,FALSE)","v":"Pontevedra"}]
["Pontevedra","Toledo","Pontevedra-hasta-Toledo",671,{"$f":"VLOOKUP(A1095,Municipios!$B$2:$B$223,1,FALSE)","v":"Pontevedra"}]
["Pontevedra","Teruel","Pontevedra-hasta-Teruel",869,{"$f":"VLOOKUP(A1096,Municipios!$B$2:$B$223,1,FALSE)","v":"Pontevedra"}]
["Salamanca","Tarragona","Salamanca-hasta-Tarragona",792,{"$f":"VLOOKUP(A1097,Municipios!$B$2:$B$223,1,FALSE)","v":"Salamanca"}]
["Salamanca","Zaragoza","Salamanca-hasta-Zaragoza",552,{"$f":"VLOOKUP(A1098,Municipios!$B$2:$B$223,1,FALSE)","v":"Salamanca"}]
["Salamanca","Zamora","Salamanca-hasta-Zamora",65,{"$f":"VLOOKUP(A1099,Municipios!$B$2:$B$223,1,FALSE)","v":"Salamanca"}]
["Salamanca","Vitoria/Gasteiz","Salamanca-hasta-Vitoria/Gasteiz",350,{"$f":"VLOOKUP(A1100,Municipios!$B$2:$B$223,1,FALSE)","v":"Salamanca"}]
["Salamanca","Valladolid","Salamanca-hasta-Valladolid",120,{"$f":"VLOOKUP(A1101,Municipios!$B$2:$B$223,1,FALSE)","v":"Salamanca"}]
["Salamanca","Valencia","Salamanca-hasta-Valencia",578,{"$f":"VLOOKUP(A1102,Municipios!$B$2:$B$223,1,FALSE)","v":"Salamanca"}]
["Salamanca","Teruel","Salamanca-hasta-Teruel",508,{"$f":"VLOOKUP(A1103,Municipios!$B$2:$B$223,1,FALSE)","v":"Salamanca"}]
["Salamanca","Soria","Salamanca-hasta-Soria",323,{"$f":"VLOOKUP(A1104,Municipios!$B$2:$B$223,1,FALSE)","v":"Salamanca"}]
["Salamanca","Sevilla","Salamanca-hasta-Sevilla",460,{"$f":"VLOOKUP(A1105,Municipios!$B$2:$B$223,1,FALSE)","v":"Salamanca"}]
["Salamanca","Segovia","Salamanca-hasta-Segovia",160,{"$f":"VLOOKUP(A1106,Municipios!$B$2:$B$223,1,FALSE)","v":"Salamanca"}]
["Salamanca","Santander","Salamanca-hasta-Santander",394,{"$f":"VLOOKUP(A1107,Municipios!$B$2:$B$223,1,FALSE)","v":"Salamanca"}]
["Salamanca","Donostia/San Sebastián","Salamanca-hasta-Donostia/San Sebastián",467,{"$f":"VLOOKUP(A1108,Municipios!$B$2:$B$223,1,FALSE)","v":"Salamanca"}]
["Salamanca","Toledo","Salamanca-hasta-Toledo",283,{"$f":"VLOOKUP(A1109,Municipios!$B$2:$B$223,1,FALSE)","v":"Salamanca"}]
["Donostia-San Sebastián","Valencia","Donostia-San Sebastián-hasta-Valencia",645,{"$f":"VLOOKUP(A1110,Municipios!$B$2:$B$223,1,FALSE)","v":"Donostia-San Sebastián"}]
["Donostia-San Sebastián","Soria","Donostia-San Sebastián-hasta-Soria",312,{"$f":"VLOOKUP(A1111,Municipios!$B$2:$B$223,1,FALSE)","v":"Donostia-San Sebastián"}]
["Donostia-San Sebastián","Zaragoza","Donostia-San Sebastián-hasta-Zaragoza",265,{"$f":"VLOOKUP(A1112,Municipios!$B$2:$B$223,1,FALSE)","v":"Donostia-San Sebastián"}]
["Donostia-San Sebastián","Zamora","Donostia-San Sebastián-hasta-Zamora",436,{"$f":"VLOOKUP(A1113,Municipios!$B$2:$B$223,1,FALSE)","v":"Donostia-San Sebastián"}]
["Donostia-San Sebastián","Vitoria/Gasteiz","Donostia-San Sebastián-hasta-Vitoria/Gasteiz",117,{"$f":"VLOOKUP(A1114,Municipios!$B$2:$B$223,1,FALSE)","v":"Donostia-San Sebastián"}]
["Donostia-San Sebastián","Valladolid","Donostia-San Sebastián-hasta-Valladolid",346,{"$f":"VLOOKUP(A1115,Municipios!$B$2:$B$223,1,FALSE)","v":"Donostia-San Sebastián"}]
["Donostia-San Sebastián","Tarragona","Donostia-San Sebastián-hasta-Tarragona",538,{"$f":"VLOOKUP(A1116,Municipios!$B$2:$B$223,1,FALSE)","v":"Donostia-San Sebastián"}]
["Donostia-San Sebastián","Sevilla","Donostia-San Sebastián-hasta-Sevilla",996,{"$f":"VLOOKUP(A1117,Municipios!$B$2:$B$223,1,FALSE)","v":"Donostia-San Sebastián"}]
["Donostia-San Sebastián","Segovia","Donostia-San Sebastián-hasta-Segovia",442,{"$f":"VLOOKUP(A1118,Municipios!$B$2:$B$223,1,FALSE)","v":"Donostia-San Sebastián"}]
["Donostia-San Sebastián","Santander","Donostia-San Sebastián-hasta-Santander",205,{"$f":"VLOOKUP(A1119,Municipios!$B$2:$B$223,1,FALSE)","v":"Donostia-San Sebastián"}]
["Donostia-San Sebastián","Toledo","Donostia-San Sebastián-hasta-Toledo",538,{"$f":"VLOOKUP(A1120,Municipios!$B$2:$B$223,1,FALSE)","v":"Donostia-San Sebastián"}]
["Donostia-San Sebastián","Teruel","Donostia-San Sebastián-hasta-Teruel",446,{"$f":"VLOOKUP(A1121,Municipios!$B$2:$B$223,1,FALSE)","v":"Donostia-San Sebastián"}]
["Santander","Tarragona","Santander-hasta-Tarragona",730,{"$f":"VLOOKUP(A1122,Municipios!$B$2:$B$223,1,FALSE)","v":"Santander"}]
["Santander","Zaragoza","Santander-hasta-Zaragoza",395,{"$f":"VLOOKUP(A1123,Municipios!$B$2:$B$223,1,FALSE)","v":"Santander"}]
["Santander","Zamora","Santander-hasta-Zamora",351,{"$f":"VLOOKUP(A1124,Municipios!$B$2:$B$223,1,FALSE)","v":"Santander"}]
["Santander","Vitoria/Gasteiz","Santander-hasta-Vitoria/Gasteiz",167,{"$f":"VLOOKUP(A1125,Municipios!$B$2:$B$223,1,FALSE)","v":"Santander"}]
["Santander","Valladolid","Santander-hasta-Valladolid",253,{"$f":"VLOOKUP(A1126,Municipios!$B$2:$B$223,1,FALSE)","v":"Santander"}]
["Santander","Valencia","Santander-hasta-Valencia",749,{"$f":"VLOOKUP(A1127,Municipios!$B$2:$B$223,1,FALSE)","v":"Santander"}]
["Santander","Toledo","Santander-hasta-Toledo",474,{"$f":"VLOOKUP(A1128,Municipios!$B$2:$B$223,1,FALSE)","v":"Santander"}]
["Santander","Teruel","Santander-hasta-Teruel",526,{"$f":"VLOOKUP(A1129,Municipios!$B$2:$B$223,1,FALSE)","v":"Santander"}]
["Santander","Soria","Santander-hasta-Soria",302,{"$f":"VLOOKUP(A1130,Municipios!$B$2:$B$223,1,FALSE)","v":"Santander"}]
["Santander","Sevilla","Santander-hasta-Sevilla",933,{"$f":"VLOOKUP(A1131,Municipios!$B$2:$B$223,1,FALSE)","v":"Santander"}]
["Santander","Segovia","Santander-hasta-Segovia",352,{"$f":"VLOOKUP(A1132,Municipios!$B$2:$B$223,1,FALSE)","v":"Santander"}]
["Segovia","Toledo","Segovia-hasta-Toledo",169,{"$f":"VLOOKUP(A1133,Municipios!$B$2:$B$223,1,FALSE)","v":"Segovia"}]
["Segovia","Zaragoza","Segovia-hasta-Zaragoza",414,{"$f":"VLOOKUP(A1134,Municipios!$B$2:$B$223,1,FALSE)","v":"Segovia"}]
["Segovia","Zamora","Segovia-hasta-Zamora",284,{"$f":"VLOOKUP(A1135,Municipios!$B$2:$B$223,1,FALSE)","v":"Segovia"}]
["Segovia","Vitoria/Gasteiz","Segovia-hasta-Vitoria/Gasteiz",305,{"$f":"VLOOKUP(A1136,Municipios!$B$2:$B$223,1,FALSE)","v":"Segovia"}]
["Segovia","Valencia","Segovia-hasta-Valencia",465,{"$f":"VLOOKUP(A1137,Municipios!$B$2:$B$223,1,FALSE)","v":"Segovia"}]
["Segovia","Valladolid","Segovia-hasta-Valladolid",141,{"$f":"VLOOKUP(A1138,Municipios!$B$2:$B$223,1,FALSE)","v":"Segovia"}]
["Segovia","Teruel","Segovia-hasta-Teruel",394,{"$f":"VLOOKUP(A1139,Municipios!$B$2:$B$223,1,FALSE)","v":"Segovia"}]
["Segovia","Tarragona","Segovia-hasta-Tarragona",679,{"$f":"VLOOKUP(A1140,Municipios!$B$2:$B$223,1,FALSE)","v":"Segovia"}]
["Segovia","Soria","Segovia-hasta-Soria",190,{"$f":"VLOOKUP(A1141,Municipios!$B$2:$B$223,1,FALSE)","v":"Segovia"}]
["Segovia","Sevilla","Segovia-hasta-Sevilla",632,{"$f":"VLOOKUP(A1142,Municipios!$B$2:$B$223,1,FALSE)","v":"Segovia"}]
["Sevilla","Toledo","Sevilla-hasta-Toledo",445,{"$f":"VLOOKUP(A1143,Municipios!$B$2:$B$223,1,FALSE)","v":"Sevilla"}]
["Sevilla","Zaragoza","Sevilla-hasta-Zaragoza",846,{"$f":"VLOOKUP(A1144,Municipios!$B$2:$B$223,1,FALSE)","v":"Sevilla"}]
["Sevilla","Zamora","Sevilla-hasta-Zamora",538,{"$f":"VLOOKUP(A1145,Municipios!$B$2:$B$223,1,FALSE)","v":"Sevilla"}]
["Sevilla","Vitoria/Gasteiz","Sevilla-hasta-Vitoria/Gasteiz",879,{"$f":"VLOOKUP(A1146,Municipios!$B$2:$B$223,1,FALSE)","v":"Sevilla"}]
["Sevilla","Valencia","Sevilla-hasta-Valencia",686,{"$f":"VLOOKUP(A1147,Municipios!$B$2:$B$223,1,FALSE)","v":"Sevilla"}]
["Sevilla","Teruel","Sevilla-hasta-Teruel",721,{"$f":"VLOOKUP(A1148,Municipios!$B$2:$B$223,1,FALSE)","v":"Sevilla"}]
["Sevilla","Tarragona","Sevilla-hasta-Tarragona",941,{"$f":"VLOOKUP(A1149,Municipios!$B$2:$B$223,1,FALSE)","v":"Sevilla"}]
["Sevilla","Soria","Sevilla-hasta-Soria",755,{"$f":"VLOOKUP(A1150,Municipios!$B$2:$B$223,1,FALSE)","v":"Sevilla"}]
["Sevilla","Valladolid",{"$f":"CONCATENATE(A1151,\"-hasta-\",B1151)","v":"Sevilla-hasta-Valladolid"},593,{"$f":"VLOOKUP(A1151,Municipios!$B$2:$B$223,1,FALSE)","v":"Sevilla"}]
["Soria","Valladolid","Soria-hasta-Valladolid",204,{"$f":"VLOOKUP(A1152,Municipios!$B$2:$B$223,1,FALSE)","v":"Soria"}]
["Soria","Zamora","Soria-hasta-Zamora",302,{"$f":"VLOOKUP(A1153,Municipios!$B$2:$B$223,1,FALSE)","v":"Soria"}]
["Soria","Vitoria/Gasteiz","Soria-hasta-Vitoria/Gasteiz",195,{"$f":"VLOOKUP(A1154,Municipios!$B$2:$B$223,1,FALSE)","v":"Soria"}]
["Soria","Toledo","Soria-hasta-Toledo",298,{"$f":"VLOOKUP(A1155,Municipios!$B$2:$B$223,1,FALSE)","v":"Soria"}]
["Soria","Teruel","Soria-hasta-Teruel",222,{"$f":"VLOOKUP(A1156,Municipios!$B$2:$B$223,1,FALSE)","v":"Soria"}]
["Soria","Tarragona","Soria-hasta-Tarragona",430,{"$f":"VLOOKUP(A1157,Municipios!$B$2:$B$223,1,FALSE)","v":"Soria"}]
["Soria","Valencia","Soria-hasta-Valencia",420,{"$f":"VLOOKUP(A1158,Municipios!$B$2:$B$223,1,FALSE)","v":"Soria"}]
["Soria","Zaragoza","Soria-hasta-Zaragoza",158,{"$f":"VLOOKUP(A1159,Municipios!$B$2:$B$223,1,FALSE)","v":"Soria"}]
["Ávila","Zaragoza","Ávila-hasta-Zaragoza",434,{"$f":"VLOOKUP(A1160,Municipios!$B$2:$B$223,1,FALSE)","v":"Ávila"}]
["Ávila","Pontevedra","Ávila-hasta-Pontevedra",529,{"$f":"VLOOKUP(A1161,Municipios!$B$2:$B$223,1,FALSE)","v":"Ávila"}]
["Ávila","Soria","Ávila-hasta-Soria",252,{"$f":"VLOOKUP(A1162,Municipios!$B$2:$B$223,1,FALSE)","v":"Ávila"}]
["Ávila","Salamanca","Ávila-hasta-Salamanca",94,{"$f":"VLOOKUP(A1163,Municipios!$B$2:$B$223,1,FALSE)","v":"Ávila"}]
["Ávila","Tarragona","Ávila-hasta-Tarragona",690,{"$f":"VLOOKUP(A1164,Municipios!$B$2:$B$223,1,FALSE)","v":"Ávila"}]
["Ávila","Donostia/San Sebastián","Ávila-hasta-Donostia/San Sebastián",507,{"$f":"VLOOKUP(A1165,Municipios!$B$2:$B$223,1,FALSE)","v":"Ávila"}]
["Ávila","Santander","Ávila-hasta-Santander",378,{"$f":"VLOOKUP(A1166,Municipios!$B$2:$B$223,1,FALSE)","v":"Ávila"}]
["Ávila","Segovia","Ávila-hasta-Segovia",66,{"$f":"VLOOKUP(A1167,Municipios!$B$2:$B$223,1,FALSE)","v":"Ávila"}]
["Ávila","Cáceres","Ávila-hasta-Cáceres",234,{"$f":"VLOOKUP(A1168,Municipios!$B$2:$B$223,1,FALSE)","v":"Ávila"}]
["Ávila","Burgos","Ávila-hasta-Burgos",282,{"$f":"VLOOKUP(A1169,Municipios!$B$2:$B$223,1,FALSE)","v":"Ávila"}]
["Ávila","Bilbao","Ávila-hasta-Bilbao",426,{"$f":"VLOOKUP(A1170,Municipios!$B$2:$B$223,1,FALSE)","v":"Ávila"}]
["Ávila","Badajoz","Ávila-hasta-Badajoz",386,{"$f":"VLOOKUP(A1171,Municipios!$B$2:$B$223,1,FALSE)","v":"Ávila"}]
["Ávila","Zamora","Ávila-hasta-Zamora",159,{"$f":"VLOOKUP(A1172,Municipios!$B$2:$B$223,1,FALSE)","v":"Ávila"}]
["Ávila","Vitoria/Gasteiz","Ávila-hasta-Vitoria/Gasteiz",390,{"$f":"VLOOKUP(A1173,Municipios!$B$2:$B$223,1,FALSE)","v":"Ávila"}]
["Ávila","Valladolid","Ávila-hasta-Valladolid",160,{"$f":"VLOOKUP(A1174,Municipios!$B$2:$B$223,1,FALSE)","v":"Ávila"}]
["Ávila","Valencia","Ávila-hasta-Valencia",485,{"$f":"VLOOKUP(A1175,Municipios!$B$2:$B$223,1,FALSE)","v":"Ávila"}]
["Ávila","Toledo","Ávila-hasta-Toledo",133,{"$f":"VLOOKUP(A1176,Municipios!$B$2:$B$223,1,FALSE)","v":"Ávila"}]
["Ávila","Teruel","Ávila-hasta-Teruel",414,{"$f":"VLOOKUP(A1177,Municipios!$B$2:$B$223,1,FALSE)","v":"Ávila"}]
["Ávila","Pamplona/Iruña","Ávila-hasta-Pamplona/Iruña",480,{"$f":"VLOOKUP(A1178,Municipios!$B$2:$B$223,1,FALSE)","v":"Ávila"}]
["Ávila","Málaga","Ávila-hasta-Málaga",673,{"$f":"VLOOKUP(A1179,Municipios!$B$2:$B$223,1,FALSE)","v":"Ávila"}]
["Ávila","Barcelona","Ávila-hasta-Barcelona",734,{"$f":"VLOOKUP(A1180,Municipios!$B$2:$B$223,1,FALSE)","v":"Ávila"}]
["Ávila","Castellón de la Plana/Castelló de la Plana","Ávila-hasta-Castellón de la Plana/Castelló de la Plana",557,{"$f":"VLOOKUP(A1181,Municipios!$B$2:$B$223,1,FALSE)","v":"Ávila"}]
["Ávila","Jaén","Ávila-hasta-Jaén",450,{"$f":"VLOOKUP(A1182,Municipios!$B$2:$B$223,1,FALSE)","v":"Ávila"}]
["Ávila","Huelva","Ávila-hasta-Huelva",596,{"$f":"VLOOKUP(A1183,Municipios!$B$2:$B$223,1,FALSE)","v":"Ávila"}]
["Ávila","Ourense","Ávila-hasta-Ourense",441,{"$f":"VLOOKUP(A1184,Municipios!$B$2:$B$223,1,FALSE)","v":"Ávila"}]
["Ávila","Guadalajara","Ávila-hasta-Guadalajara",174,{"$f":"VLOOKUP(A1185,Municipios!$B$2:$B$223,1,FALSE)","v":"Ávila"}]
["Ávila","Palencia","Ávila-hasta-Palencia",184,{"$f":"VLOOKUP(A1186,Municipios!$B$2:$B$223,1,FALSE)","v":"Ávila"}]
["Ávila","Granada","Ávila-hasta-Granada",541,{"$f":"VLOOKUP(A1187,Municipios!$B$2:$B$223,1,FALSE)","v":"Ávila"}]
["Ávila","Girona","Ávila-hasta-Girona",816,{"$f":"VLOOKUP(A1188,Municipios!$B$2:$B$223,1,FALSE)","v":"Ávila"}]
["Ávila","Cuenca","Ávila-hasta-Cuenca",300,{"$f":"VLOOKUP(A1189,Municipios!$B$2:$B$223,1,FALSE)","v":"Ávila"}]
["Ávila","Coruña (A)","Ávila-hasta-Coruña (A)",540,{"$f":"VLOOKUP(A1190,Municipios!$B$2:$B$223,1,FALSE)","v":"Ávila"}]
["Ávila","Huesca","Ávila-hasta-Huesca",505,{"$f":"VLOOKUP(A1191,Municipios!$B$2:$B$223,1,FALSE)","v":"Ávila"}]
["Ávila","Ciudad Real","Ávila-hasta-Ciudad Real",305,{"$f":"VLOOKUP(A1192,Municipios!$B$2:$B$223,1,FALSE)","v":"Ávila"}]
["Ávila","Cádiz","Ávila-hasta-Cádiz",633,{"$f":"VLOOKUP(A1193,Municipios!$B$2:$B$223,1,FALSE)","v":"Ávila"}]
["Ávila","Lugo","Ávila-hasta-Lugo",451,{"$f":"VLOOKUP(A1194,Municipios!$B$2:$B$223,1,FALSE)","v":"Ávila"}]
["Ávila","León","Ávila-hasta-León",282,{"$f":"VLOOKUP(A1195,Municipios!$B$2:$B$223,1,FALSE)","v":"Ávila"}]
["Ávila","Lleida","Ávila-hasta-Lleida",595,{"$f":"VLOOKUP(A1196,Municipios!$B$2:$B$223,1,FALSE)","v":"Ávila"}]
["Ávila","Madrid","Ávila-hasta-Madrid",110,{"$f":"VLOOKUP(A1197,Municipios!$B$2:$B$223,1,FALSE)","v":"Ávila"}]
["Ávila","Logroño","Ávila-hasta-Logroño",425,{"$f":"VLOOKUP(A1198,Municipios!$B$2:$B$223,1,FALSE)","v":"Ávila"}]
["Ávila","Murcia","Ávila-hasta-Murcia",526,{"$f":"VLOOKUP(A1199,Municipios!$B$2:$B$223,1,FALSE)","v":"Ávila"}]
["Ávila","Sevilla","Ávila-hasta-Sevilla",514,{"$f":"VLOOKUP(A1200,Municipios!$B$2:$B$223,1,FALSE)","v":"Ávila"}]
["Ávila","Oviedo","Ávila-hasta-Oviedo",383,{"$f":"VLOOKUP(A1201,Municipios!$B$2:$B$223,1,FALSE)","v":"Ávila"}]
["Ávila","Córdoba","Ávila-hasta-Córdoba",514,{"$f":"VLOOKUP(A1202,Municipios!$B$2:$B$223,1,FALSE)","v":"Ávila"}]
["Tarragona","Valladolid","Tarragona-hasta-Valladolid",740,{"$f":"VLOOKUP(A1203,Municipios!$B$2:$B$223,1,FALSE)","v":"Tarragona"}]
["Tarragona","Teruel","Tarragona-hasta-Teruel",299,{"$f":"VLOOKUP(A1204,Municipios!$B$2:$B$223,1,FALSE)","v":"Tarragona"}]
["Tarragona","Valencia","Tarragona-hasta-Valencia",266,{"$f":"VLOOKUP(A1205,Municipios!$B$2:$B$223,1,FALSE)","v":"Tarragona"}]
["Tarragona","Vitoria/Gasteiz","Tarragona-hasta-Vitoria/Gasteiz",531,{"$f":"VLOOKUP(A1206,Municipios!$B$2:$B$223,1,FALSE)","v":"Tarragona"}]
["Tarragona","Zamora","Tarragona-hasta-Zamora",732,{"$f":"VLOOKUP(A1207,Municipios!$B$2:$B$223,1,FALSE)","v":"Tarragona"}]
["Tarragona","Zaragoza","Tarragona-hasta-Zaragoza",273,{"$f":"VLOOKUP(A1208,Municipios!$B$2:$B$223,1,FALSE)","v":"Tarragona"}]
["Tarragona","Toledo","Tarragona-hasta-Toledo",652,{"$f":"VLOOKUP(A1209,Municipios!$B$2:$B$223,1,FALSE)","v":"Tarragona"}]
["Teruel","Toledo","Teruel-hasta-Toledo",327,{"$f":"VLOOKUP(A1210,Municipios!$B$2:$B$223,1,FALSE)","v":"Teruel"}]
["Teruel","Valencia","Teruel-hasta-Valencia",198,{"$f":"VLOOKUP(A1211,Municipios!$B$2:$B$223,1,FALSE)","v":"Teruel"}]
["Teruel","Valladolid","Teruel-hasta-Valladolid",436,{"$f":"VLOOKUP(A1212,Municipios!$B$2:$B$223,1,FALSE)","v":"Teruel"}]
["Teruel","Vitoria/Gasteiz","Teruel-hasta-Vitoria/Gasteiz",441,{"$f":"VLOOKUP(A1213,Municipios!$B$2:$B$223,1,FALSE)","v":"Teruel"}]
["Teruel","Zamora","Teruel-hasta-Zamora",534,{"$f":"VLOOKUP(A1214,Municipios!$B$2:$B$223,1,FALSE)","v":"Teruel"}]
["Teruel","Zaragoza",{"$f":"CONCATENATE(A1215,\"-hasta-\",B1215)","v":"Teruel-hasta-Zaragoza"},181,{"$f":"VLOOKUP(A1215,Municipios!$B$2:$B$223,1,FALSE)","v":"Teruel"}]
["Toledo","Zaragoza","Toledo-hasta-Zaragoza",387,{"$f":"VLOOKUP(A1216,Municipios!$B$2:$B$223,1,FALSE)","v":"Toledo"}]
["Toledo","Valencia","Toledo-hasta-Valencia",361,{"$f":"VLOOKUP(A1217,Municipios!$B$2:$B$223,1,FALSE)","v":"Toledo"}]
["Toledo","Valladolid","Toledo-hasta-Valladolid",287,{"$f":"VLOOKUP(A1218,Municipios!$B$2:$B$223,1,FALSE)","v":"Toledo"}]
["Toledo","Vitoria/Gasteiz","Toledo-hasta-Vitoria/Gasteiz",421,{"$f":"VLOOKUP(A1219,Municipios!$B$2:$B$223,1,FALSE)","v":"Toledo"}]
["Toledo","Zamora","Toledo-hasta-Zamora",328,{"$f":"VLOOKUP(A1220,Municipios!$B$2:$B$223,1,FALSE)","v":"Toledo"}]
["Valencia","Vitoria/Gasteiz","Valencia-hasta-Vitoria/Gasteiz",640,{"$f":"VLOOKUP(A1221,Municipios!$B$2:$B$223,1,FALSE)","v":"Valencia"}]
["Valencia","Zamora","Valencia-hasta-Zamora",624,{"$f":"VLOOKUP(A1222,Municipios!$B$2:$B$223,1,FALSE)","v":"Valencia"}]
["Valencia","Zaragoza","Valencia-hasta-Zaragoza",380,{"$f":"VLOOKUP(A1223,Municipios!$B$2:$B$223,1,FALSE)","v":"Valencia"}]
["Valencia","Valladolid","Valencia-hasta-Valladolid",585,{"$f":"VLOOKUP(A1224,Municipios!$B$2:$B$223,1,FALSE)","v":"Valencia"}]
["Valladolid","Vitoria/Gasteiz","Valladolid-hasta-Vitoria/Gasteiz",229,{"$f":"VLOOKUP(A1225,Municipios!$B$2:$B$223,1,FALSE)","v":"Valladolid"}]
["Valladolid","Zamora","Valladolid-hasta-Zamora",89,{"$f":"VLOOKUP(A1226,Municipios!$B$2:$B$223,1,FALSE)","v":"Valladolid"}]
["Valladolid","Zaragoza","Valladolid-hasta-Zaragoza",435,{"$f":"VLOOKUP(A1227,Municipios!$B$2:$B$223,1,FALSE)","v":"Valladolid"}]
["Vitoria-Gasteiz","Zamora","Vitoria-Gasteiz-hasta-Zamora",319,{"$f":"VLOOKUP(A1228,Municipios!$B$2:$B$223,1,FALSE)","v":"Vitoria-Gasteiz"}]
["Vitoria-Gasteiz","Zaragoza","Vitoria-Gasteiz-hasta-Zaragoza",260,{"$f":"VLOOKUP(A1229,Municipios!$B$2:$B$223,1,FALSE)","v":"Vitoria-Gasteiz"}]
["Zamora","Zaragoza","Zamora-hasta-Zaragoza",460,{"$f":"VLOOKUP(A1230,Municipios!$B$2:$B$223,1,FALSE)","v":"Zamora"}]
["Badajoz","Madrid","Badajoz-hasta-Madrid",407,{"$f":"VLOOKUP(A1231,Municipios!$B$2:$B$223,1,FALSE)","v":"Badajoz"}]
["Badajoz","Valencia","Badajoz-hasta-Valencia",713,{"$f":"VLOOKUP(A1232,Municipios!$B$2:$B$223,1,FALSE)","v":"Badajoz"}]
["Badajoz","Lugo","Badajoz-hasta-Lugo",705,{"$f":"VLOOKUP(A1233,Municipios!$B$2:$B$223,1,FALSE)","v":"Badajoz"}]
["Badajoz","Donostia/San Sebastián","Badajoz-hasta-Donostia/San Sebastián",818,{"$f":"VLOOKUP(A1234,Municipios!$B$2:$B$223,1,FALSE)","v":"Badajoz"}]
["Badajoz","Santander","Badajoz-hasta-Santander",706,{"$f":"VLOOKUP(A1235,Municipios!$B$2:$B$223,1,FALSE)","v":"Badajoz"}]
["Badajoz","Segovia","Badajoz-hasta-Segovia",457,{"$f":"VLOOKUP(A1236,Municipios!$B$2:$B$223,1,FALSE)","v":"Badajoz"}]
["Badajoz","Sevilla","Badajoz-hasta-Sevilla",261,{"$f":"VLOOKUP(A1237,Municipios!$B$2:$B$223,1,FALSE)","v":"Badajoz"}]
["Badajoz","Soria","Badajoz-hasta-Soria",637,{"$f":"VLOOKUP(A1238,Municipios!$B$2:$B$223,1,FALSE)","v":"Badajoz"}]
["Badajoz","Tarragona","Badajoz-hasta-Tarragona",1017,{"$f":"VLOOKUP(A1239,Municipios!$B$2:$B$223,1,FALSE)","v":"Badajoz"}]
["Badajoz","Pontevedra","Badajoz-hasta-Pontevedra",791,{"$f":"VLOOKUP(A1240,Municipios!$B$2:$B$223,1,FALSE)","v":"Badajoz"}]
["Badajoz","Toledo","Badajoz-hasta-Toledo",375,{"$f":"VLOOKUP(A1241,Municipios!$B$2:$B$223,1,FALSE)","v":"Badajoz"}]
["Badajoz","Pamplona/Iruña","Badajoz-hasta-Pamplona/Iruña",791,{"$f":"VLOOKUP(A1242,Municipios!$B$2:$B$223,1,FALSE)","v":"Badajoz"}]
["Badajoz","Valladolid","Badajoz-hasta-Valladolid",465,{"$f":"VLOOKUP(A1243,Municipios!$B$2:$B$223,1,FALSE)","v":"Badajoz"}]
["Badajoz","Vitoria/Gasteiz","Badajoz-hasta-Vitoria/Gasteiz",701,{"$f":"VLOOKUP(A1244,Municipios!$B$2:$B$223,1,FALSE)","v":"Badajoz"}]
["Badajoz","Zamora","Badajoz-hasta-Zamora",410,{"$f":"VLOOKUP(A1245,Municipios!$B$2:$B$223,1,FALSE)","v":"Badajoz"}]
["Badajoz","Zaragoza","Badajoz-hasta-Zaragoza",705,{"$f":"VLOOKUP(A1246,Municipios!$B$2:$B$223,1,FALSE)","v":"Badajoz"}]
["Badajoz","Barcelona","Badajoz-hasta-Barcelona",1030,{"$f":"VLOOKUP(A1247,Municipios!$B$2:$B$223,1,FALSE)","v":"Badajoz"}]
["Badajoz","Bilbao","Badajoz-hasta-Bilbao",737,{"$f":"VLOOKUP(A1248,Municipios!$B$2:$B$223,1,FALSE)","v":"Badajoz"}]
["Badajoz","Burgos","Badajoz-hasta-Burgos",593,{"$f":"VLOOKUP(A1249,Municipios!$B$2:$B$223,1,FALSE)","v":"Badajoz"}]
["Badajoz","Cáceres","Badajoz-hasta-Cáceres",133,{"$f":"VLOOKUP(A1250,Municipios!$B$2:$B$223,1,FALSE)","v":"Badajoz"}]
["Badajoz","Teruel","Badajoz-hasta-Teruel",709,{"$f":"VLOOKUP(A1251,Municipios!$B$2:$B$223,1,FALSE)","v":"Badajoz"}]
["Badajoz","Huesca","Badajoz-hasta-Huesca",800,{"$f":"VLOOKUP(A1252,Municipios!$B$2:$B$223,1,FALSE)","v":"Badajoz"}]
["Badajoz","Castellón de la Plana/Castelló de la Plana","Badajoz-hasta-Castellón de la Plana/Castelló de la Plana",780,{"$f":"VLOOKUP(A1253,Municipios!$B$2:$B$223,1,FALSE)","v":"Badajoz"}]
["Badajoz","Ciudad Real","Badajoz-hasta-Ciudad Real",311,{"$f":"VLOOKUP(A1254,Municipios!$B$2:$B$223,1,FALSE)","v":"Badajoz"}]
["Badajoz","Córdoba","Badajoz-hasta-Córdoba",276,{"$f":"VLOOKUP(A1255,Municipios!$B$2:$B$223,1,FALSE)","v":"Badajoz"}]
["Badajoz","Coruña (A)","Badajoz-hasta-Coruña (A)",796,{"$f":"VLOOKUP(A1256,Municipios!$B$2:$B$223,1,FALSE)","v":"Badajoz"}]
["Badajoz","Cuenca","Badajoz-hasta-Cuenca",535,{"$f":"VLOOKUP(A1257,Municipios!$B$2:$B$223,1,FALSE)","v":"Badajoz"}]
["Badajoz","Girona","Badajoz-hasta-Girona",1111,{"$f":"VLOOKUP(A1258,Municipios!$B$2:$B$223,1,FALSE)","v":"Badajoz"}]
["Badajoz","Granada","Badajoz-hasta-Granada",435,{"$f":"VLOOKUP(A1259,Municipios!$B$2:$B$223,1,FALSE)","v":"Badajoz"}]
["Badajoz","Salamanca","Badajoz-hasta-Salamanca",345,{"$f":"VLOOKUP(A1260,Municipios!$B$2:$B$223,1,FALSE)","v":"Badajoz"}]
["Badajoz","Huelva","Badajoz-hasta-Huelva",346,{"$f":"VLOOKUP(A1261,Municipios!$B$2:$B$223,1,FALSE)","v":"Badajoz"}]
["Badajoz","Cádiz","Badajoz-hasta-Cádiz",380,{"$f":"VLOOKUP(A1262,Municipios!$B$2:$B$223,1,FALSE)","v":"Badajoz"}]
["Badajoz","Jaén","Badajoz-hasta-Jaén",416,{"$f":"VLOOKUP(A1263,Municipios!$B$2:$B$223,1,FALSE)","v":"Badajoz"}]
["Badajoz","León","Badajoz-hasta-León",546,{"$f":"VLOOKUP(A1264,Municipios!$B$2:$B$223,1,FALSE)","v":"Badajoz"}]
["Badajoz","Logroño","Badajoz-hasta-Logroño",612,{"$f":"VLOOKUP(A1265,Municipios!$B$2:$B$223,1,FALSE)","v":"Badajoz"}]
["Badajoz","Lleida","Badajoz-hasta-Lleida",891,{"$f":"VLOOKUP(A1266,Municipios!$B$2:$B$223,1,FALSE)","v":"Badajoz"}]
["Badajoz","Málaga","Badajoz-hasta-Málaga",461,{"$f":"VLOOKUP(A1267,Municipios!$B$2:$B$223,1,FALSE)","v":"Badajoz"}]
["Badajoz","Murcia","Badajoz-hasta-Murcia",661,{"$f":"VLOOKUP(A1268,Municipios!$B$2:$B$223,1,FALSE)","v":"Badajoz"}]
["Badajoz","Ourense","Badajoz-hasta-Ourense",703,{"$f":"VLOOKUP(A1269,Municipios!$B$2:$B$223,1,FALSE)","v":"Badajoz"}]
["Badajoz","Oviedo","Badajoz-hasta-Oviedo",664,{"$f":"VLOOKUP(A1270,Municipios!$B$2:$B$223,1,FALSE)","v":"Badajoz"}]
["Badajoz","Palencia","Badajoz-hasta-Palencia",507,{"$f":"VLOOKUP(A1271,Municipios!$B$2:$B$223,1,FALSE)","v":"Badajoz"}]
["Badajoz","Guadalajara","Badajoz-hasta-Guadalajara",470,{"$f":"VLOOKUP(A1272,Municipios!$B$2:$B$223,1,FALSE)","v":"Badajoz"}]
["Barcelona","Huelva","Barcelona-hasta-Huelva",1127,{"$f":"VLOOKUP(A1273,Municipios!$B$2:$B$223,1,FALSE)","v":"Barcelona"}]
["Barcelona","Cuenca","Barcelona-hasta-Cuenca",552,{"$f":"VLOOKUP(A1274,Municipios!$B$2:$B$223,1,FALSE)","v":"Barcelona"}]
["Barcelona","Sevilla","Barcelona-hasta-Sevilla",1036,{"$f":"VLOOKUP(A1275,Municipios!$B$2:$B$223,1,FALSE)","v":"Barcelona"}]
["Barcelona","Soria","Barcelona-hasta-Soria",466,{"$f":"VLOOKUP(A1276,Municipios!$B$2:$B$223,1,FALSE)","v":"Barcelona"}]
["Barcelona","Teruel","Barcelona-hasta-Teruel",404,{"$f":"VLOOKUP(A1277,Municipios!$B$2:$B$223,1,FALSE)","v":"Barcelona"}]
["Barcelona","Toledo","Barcelona-hasta-Toledo",690,{"$f":"VLOOKUP(A1278,Municipios!$B$2:$B$223,1,FALSE)","v":"Barcelona"}]
["Barcelona","Valencia",{"$f":"CONCATENATE(A1279,\"-hasta-\",B1279)","v":"Barcelona-hasta-Valencia"},353,{"$f":"VLOOKUP(A1279,Municipios!$B$2:$B$223,1,FALSE)","v":"Barcelona"}]
["Barcelona","Valladolid","Barcelona-hasta-Valladolid",739,{"$f":"VLOOKUP(A1280,Municipios!$B$2:$B$223,1,FALSE)","v":"Barcelona"}]
["Barcelona","Zaragoza","Barcelona-hasta-Zaragoza",286,{"$f":"VLOOKUP(A1281,Municipios!$B$2:$B$223,1,FALSE)","v":"Barcelona"}]
["Barcelona","Segovia","Barcelona-hasta-Segovia",651,{"$f":"VLOOKUP(A1282,Municipios!$B$2:$B$223,1,FALSE)","v":"Barcelona"}]
["Barcelona","Cáceres","Barcelona-hasta-Cáceres",919,{"$f":"VLOOKUP(A1283,Municipios!$B$2:$B$223,1,FALSE)","v":"Barcelona"}]
["Barcelona","Zamora","Barcelona-hasta-Zamora",770,{"$f":"VLOOKUP(A1284,Municipios!$B$2:$B$223,1,FALSE)","v":"Barcelona"}]
["Barcelona","Granada","Barcelona-hasta-Granada",932,{"$f":"VLOOKUP(A1285,Municipios!$B$2:$B$223,1,FALSE)","v":"Barcelona"}]
["Barcelona","Huesca","Barcelona-hasta-Huesca",262,{"$f":"VLOOKUP(A1286,Municipios!$B$2:$B$223,1,FALSE)","v":"Barcelona"}]
["Barcelona","Cádiz","Barcelona-hasta-Cádiz",1148,{"$f":"VLOOKUP(A1287,Municipios!$B$2:$B$223,1,FALSE)","v":"Barcelona"}]
["Barcelona","Lleida","Barcelona-hasta-Lleida",171,{"$f":"VLOOKUP(A1288,Municipios!$B$2:$B$223,1,FALSE)","v":"Barcelona"}]
["Barcelona","Oviedo","Barcelona-hasta-Oviedo",922,{"$f":"VLOOKUP(A1289,Municipios!$B$2:$B$223,1,FALSE)","v":"Barcelona"}]
["Barcelona","Donostia/San Sebastián","Barcelona-hasta-Donostia/San Sebastián",551,{"$f":"VLOOKUP(A1290,Municipios!$B$2:$B$223,1,FALSE)","v":"Barcelona"}]
["Barcelona","Tarragona","Barcelona-hasta-Tarragona",93,{"$f":"VLOOKUP(A1291,Municipios!$B$2:$B$223,1,FALSE)","v":"Barcelona"}]
["Barcelona","Vitoria/Gasteiz","Barcelona-hasta-Vitoria/Gasteiz",546,{"$f":"VLOOKUP(A1292,Municipios!$B$2:$B$223,1,FALSE)","v":"Barcelona"}]
["Barcelona","Burgos","Barcelona-hasta-Burgos",610,{"$f":"VLOOKUP(A1293,Municipios!$B$2:$B$223,1,FALSE)","v":"Barcelona"}]
["Barcelona","Coruña (A)","Barcelona-hasta-Coruña (A)",1116,{"$f":"VLOOKUP(A1294,Municipios!$B$2:$B$223,1,FALSE)","v":"Barcelona"}]
["Barcelona","Castellón de la Plana/Castelló de la Plana","Barcelona-hasta-Castellón de la Plana/Castelló de la Plana",271,{"$f":"VLOOKUP(A1295,Municipios!$B$2:$B$223,1,FALSE)","v":"Barcelona"}]
["Barcelona","Bilbao","Barcelona-hasta-Bilbao",589,{"$f":"VLOOKUP(A1296,Municipios!$B$2:$B$223,1,FALSE)","v":"Barcelona"}]
["Barcelona","Córdoba","Barcelona-hasta-Córdoba",898,{"$f":"VLOOKUP(A1297,Municipios!$B$2:$B$223,1,FALSE)","v":"Barcelona"}]
["Barcelona","Santander","Barcelona-hasta-Santander",768,{"$f":"VLOOKUP(A1298,Municipios!$B$2:$B$223,1,FALSE)","v":"Barcelona"}]
["Barcelona","Girona","Barcelona-hasta-Girona",86,{"$f":"VLOOKUP(A1299,Municipios!$B$2:$B$223,1,FALSE)","v":"Barcelona"}]
["Barcelona","Guadalajara","Barcelona-hasta-Guadalajara",560,{"$f":"VLOOKUP(A1300,Municipios!$B$2:$B$223,1,FALSE)","v":"Barcelona"}]
["Barcelona","Jaén","Barcelona-hasta-Jaén",834,{"$f":"VLOOKUP(A1301,Municipios!$B$2:$B$223,1,FALSE)","v":"Barcelona"}]
["Barcelona","León","Barcelona-hasta-León",804,{"$f":"VLOOKUP(A1302,Municipios!$B$2:$B$223,1,FALSE)","v":"Barcelona"}]
["Barcelona","Logroño","Barcelona-hasta-Logroño",471,{"$f":"VLOOKUP(A1303,Municipios!$B$2:$B$223,1,FALSE)","v":"Barcelona"}]
["Barcelona","Lugo","Barcelona-hasta-Lugo",1025,{"$f":"VLOOKUP(A1304,Municipios!$B$2:$B$223,1,FALSE)","v":"Barcelona"}]
["Barcelona","Pamplona/Iruña","Barcelona-hasta-Pamplona/Iruña",461,{"$f":"VLOOKUP(A1305,Municipios!$B$2:$B$223,1,FALSE)","v":"Barcelona"}]
["Barcelona","Ciudad Real","Barcelona-hasta-Ciudad Real",754,{"$f":"VLOOKUP(A1306,Municipios!$B$2:$B$223,1,FALSE)","v":"Barcelona"}]
["Barcelona","Madrid","Barcelona-hasta-Madrid",612,{"$f":"VLOOKUP(A1307,Municipios!$B$2:$B$223,1,FALSE)","v":"Barcelona"}]
["Barcelona","Pontevedra","Barcelona-hasta-Pontevedra",1047,{"$f":"VLOOKUP(A1308,Municipios!$B$2:$B$223,1,FALSE)","v":"Barcelona"}]
["Barcelona","Palencia","Barcelona-hasta-Palencia",710,{"$f":"VLOOKUP(A1309,Municipios!$B$2:$B$223,1,FALSE)","v":"Barcelona"}]
["Barcelona","Ourense","Barcelona-hasta-Ourense",953,{"$f":"VLOOKUP(A1310,Municipios!$B$2:$B$223,1,FALSE)","v":"Barcelona"}]
["Barcelona","Murcia","Barcelona-hasta-Murcia",615,{"$f":"VLOOKUP(A1311,Municipios!$B$2:$B$223,1,FALSE)","v":"Barcelona"}]
["Barcelona","Málaga","Barcelona-hasta-Málaga",1057,{"$f":"VLOOKUP(A1312,Municipios!$B$2:$B$223,1,FALSE)","v":"Barcelona"}]
["Barcelona","Salamanca","Barcelona-hasta-Salamanca",828,{"$f":"VLOOKUP(A1313,Municipios!$B$2:$B$223,1,FALSE)","v":"Barcelona"}]
["Bilbao","Burgos","Bilbao-hasta-Burgos",145,{"$f":"VLOOKUP(A1314,Municipios!$B$2:$B$223,1,FALSE)","v":"Bilbao"}]
["Bilbao","Segovia","Bilbao-hasta-Segovia",339,{"$f":"VLOOKUP(A1315,Municipios!$B$2:$B$223,1,FALSE)","v":"Bilbao"}]
["Bilbao","Toledo","Bilbao-hasta-Toledo",457,{"$f":"VLOOKUP(A1316,Municipios!$B$2:$B$223,1,FALSE)","v":"Bilbao"}]
["Bilbao","Sevilla","Bilbao-hasta-Sevilla",916,{"$f":"VLOOKUP(A1317,Municipios!$B$2:$B$223,1,FALSE)","v":"Bilbao"}]
["Bilbao","Soria","Bilbao-hasta-Soria",233,{"$f":"VLOOKUP(A1318,Municipios!$B$2:$B$223,1,FALSE)","v":"Bilbao"}]
["Bilbao","Santander","Bilbao-hasta-Santander",100,{"$f":"VLOOKUP(A1319,Municipios!$B$2:$B$223,1,FALSE)","v":"Bilbao"}]
["Bilbao","Tarragona","Bilbao-hasta-Tarragona",565,{"$f":"VLOOKUP(A1320,Municipios!$B$2:$B$223,1,FALSE)","v":"Bilbao"}]
["Bilbao","Teruel","Bilbao-hasta-Teruel",479,{"$f":"VLOOKUP(A1321,Municipios!$B$2:$B$223,1,FALSE)","v":"Bilbao"}]
["Bilbao","Valencia","Bilbao-hasta-Valencia",678,{"$f":"VLOOKUP(A1322,Municipios!$B$2:$B$223,1,FALSE)","v":"Bilbao"}]
["Bilbao","Valladolid","Bilbao-hasta-Valladolid",271,{"$f":"VLOOKUP(A1323,Municipios!$B$2:$B$223,1,FALSE)","v":"Bilbao"}]
["Bilbao","Vitoria/Gasteiz","Bilbao-hasta-Vitoria/Gasteiz",67,{"$f":"VLOOKUP(A1324,Municipios!$B$2:$B$223,1,FALSE)","v":"Bilbao"}]
["Bilbao","Zaragoza","Bilbao-hasta-Zaragoza",298,{"$f":"VLOOKUP(A1325,Municipios!$B$2:$B$223,1,FALSE)","v":"Bilbao"}]
["Bilbao","Cáceres","Bilbao-hasta-Cáceres",609,{"$f":"VLOOKUP(A1326,Municipios!$B$2:$B$223,1,FALSE)","v":"Bilbao"}]
["Bilbao","Lleida","Bilbao-hasta-Lleida",459,{"$f":"VLOOKUP(A1327,Municipios!$B$2:$B$223,1,FALSE)","v":"Bilbao"}]
["Bilbao","Donostia/San Sebastián","Bilbao-hasta-Donostia/San Sebastián",105,{"$f":"VLOOKUP(A1328,Municipios!$B$2:$B$223,1,FALSE)","v":"Bilbao"}]
["Bilbao","Zamora","Bilbao-hasta-Zamora",373,{"$f":"VLOOKUP(A1329,Municipios!$B$2:$B$223,1,FALSE)","v":"Bilbao"}]
["Bilbao","Cuenca","Bilbao-hasta-Cuenca",546,{"$f":"VLOOKUP(A1330,Municipios!$B$2:$B$223,1,FALSE)","v":"Bilbao"}]
["Bilbao","Cádiz","Bilbao-hasta-Cádiz",1029,{"$f":"VLOOKUP(A1331,Municipios!$B$2:$B$223,1,FALSE)","v":"Bilbao"}]
["Bilbao","Castellón de la Plana/Castelló de la Plana","Bilbao-hasta-Castellón de la Plana/Castelló de la Plana",743,{"$f":"VLOOKUP(A1332,Municipios!$B$2:$B$223,1,FALSE)","v":"Bilbao"}]
["Bilbao","Ciudad Real","Bilbao-hasta-Ciudad Real",572,{"$f":"VLOOKUP(A1333,Municipios!$B$2:$B$223,1,FALSE)","v":"Bilbao"}]
["Bilbao","Málaga","Bilbao-hasta-Málaga",920,{"$f":"VLOOKUP(A1334,Municipios!$B$2:$B$223,1,FALSE)","v":"Bilbao"}]
["Bilbao","Coruña (A)","Bilbao-hasta-Coruña (A)",651,{"$f":"VLOOKUP(A1335,Municipios!$B$2:$B$223,1,FALSE)","v":"Bilbao"}]
["Bilbao","Salamanca","Bilbao-hasta-Salamanca",394,{"$f":"VLOOKUP(A1336,Municipios!$B$2:$B$223,1,FALSE)","v":"Bilbao"}]
["Bilbao","Girona","Bilbao-hasta-Girona",626,{"$f":"VLOOKUP(A1337,Municipios!$B$2:$B$223,1,FALSE)","v":"Bilbao"}]
["Bilbao","Granada","Bilbao-hasta-Granada",805,{"$f":"VLOOKUP(A1338,Municipios!$B$2:$B$223,1,FALSE)","v":"Bilbao"}]
["Bilbao","Guadalajara","Bilbao-hasta-Guadalajara",382,{"$f":"VLOOKUP(A1339,Municipios!$B$2:$B$223,1,FALSE)","v":"Bilbao"}]
["Bilbao","Huelva","Bilbao-hasta-Huelva",1007,{"$f":"VLOOKUP(A1340,Municipios!$B$2:$B$223,1,FALSE)","v":"Bilbao"}]
["Bilbao","Huesca","Bilbao-hasta-Huesca",369,{"$f":"VLOOKUP(A1341,Municipios!$B$2:$B$223,1,FALSE)","v":"Bilbao"}]
["Bilbao","Jaén","Bilbao-hasta-Jaén",714,{"$f":"VLOOKUP(A1342,Municipios!$B$2:$B$223,1,FALSE)","v":"Bilbao"}]
["Bilbao","Oviedo",{"$f":"CONCATENATE(A1343,\"-hasta-\",B1343)","v":"Bilbao-hasta-Oviedo"},293,{"$f":"VLOOKUP(A1343,Municipios!$B$2:$B$223,1,FALSE)","v":"Bilbao"}]
["Bilbao","Córdoba","Bilbao-hasta-Córdoba",778,{"$f":"VLOOKUP(A1344,Municipios!$B$2:$B$223,1,FALSE)","v":"Bilbao"}]
["Bilbao","León","Bilbao-hasta-León",339,{"$f":"VLOOKUP(A1345,Municipios!$B$2:$B$223,1,FALSE)","v":"Bilbao"}]
["Bilbao","Pontevedra","Bilbao-hasta-Pontevedra",581,{"$f":"VLOOKUP(A1346,Municipios!$B$2:$B$223,1,FALSE)","v":"Bilbao"}]
["Bilbao","Palencia","Bilbao-hasta-Palencia",252,{"$f":"VLOOKUP(A1347,Municipios!$B$2:$B$223,1,FALSE)","v":"Bilbao"}]
["Bilbao","Ourense","Bilbao-hasta-Ourense",488,{"$f":"VLOOKUP(A1348,Municipios!$B$2:$B$223,1,FALSE)","v":"Bilbao"}]
["Bilbao","Murcia","Bilbao-hasta-Murcia",767,{"$f":"VLOOKUP(A1349,Municipios!$B$2:$B$223,1,FALSE)","v":"Bilbao"}]
["Bilbao","Madrid","Bilbao-hasta-Madrid",370,{"$f":"VLOOKUP(A1350,Municipios!$B$2:$B$223,1,FALSE)","v":"Bilbao"}]
["Bilbao","Lugo","Bilbao-hasta-Lugo",560,{"$f":"VLOOKUP(A1351,Municipios!$B$2:$B$223,1,FALSE)","v":"Bilbao"}]
["Bilbao","Logroño","Bilbao-hasta-Logroño",127,{"$f":"VLOOKUP(A1352,Municipios!$B$2:$B$223,1,FALSE)","v":"Bilbao"}]
["Bilbao","Pamplona/Iruña","Bilbao-hasta-Pamplona/Iruña",157,{"$f":"VLOOKUP(A1353,Municipios!$B$2:$B$223,1,FALSE)","v":"Bilbao"}]
["Burgos","Santander","Burgos-hasta-Santander",152,{"$f":"VLOOKUP(A1354,Municipios!$B$2:$B$223,1,FALSE)","v":"Burgos"}]
["Burgos","Cáceres","Burgos-hasta-Cáceres",545,{"$f":"VLOOKUP(A1355,Municipios!$B$2:$B$223,1,FALSE)","v":"Burgos"}]
["Burgos","Teruel","Burgos-hasta-Teruel",370,{"$f":"VLOOKUP(A1356,Municipios!$B$2:$B$223,1,FALSE)","v":"Burgos"}]
["Burgos","Donostia/San Sebastián","Burgos-hasta-Donostia/San Sebastián",225,{"$f":"VLOOKUP(A1357,Municipios!$B$2:$B$223,1,FALSE)","v":"Burgos"}]
["Burgos","Segovia","Burgos-hasta-Segovia",197,{"$f":"VLOOKUP(A1358,Municipios!$B$2:$B$223,1,FALSE)","v":"Burgos"}]
["Burgos","Sevilla","Burgos-hasta-Sevilla",771,{"$f":"VLOOKUP(A1359,Municipios!$B$2:$B$223,1,FALSE)","v":"Burgos"}]
["Burgos","Soria","Burgos-hasta-Soria",147,{"$f":"VLOOKUP(A1360,Municipios!$B$2:$B$223,1,FALSE)","v":"Burgos"}]
["Burgos","Tarragona","Burgos-hasta-Tarragona",572,{"$f":"VLOOKUP(A1361,Municipios!$B$2:$B$223,1,FALSE)","v":"Burgos"}]
["Burgos","Toledo","Burgos-hasta-Toledo",313,{"$f":"VLOOKUP(A1362,Municipios!$B$2:$B$223,1,FALSE)","v":"Burgos"}]
["Burgos","Valencia","Burgos-hasta-Valencia",583,{"$f":"VLOOKUP(A1363,Municipios!$B$2:$B$223,1,FALSE)","v":"Burgos"}]
["Burgos","Valladolid","Burgos-hasta-Valladolid",121,{"$f":"VLOOKUP(A1364,Municipios!$B$2:$B$223,1,FALSE)","v":"Burgos"}]
["Burgos","Vitoria/Gasteiz","Burgos-hasta-Vitoria/Gasteiz",108,{"$f":"VLOOKUP(A1365,Municipios!$B$2:$B$223,1,FALSE)","v":"Burgos"}]
["Burgos","Zaragoza","Burgos-hasta-Zaragoza",306,{"$f":"VLOOKUP(A1366,Municipios!$B$2:$B$223,1,FALSE)","v":"Burgos"}]
["Burgos","Salamanca","Burgos-hasta-Salamanca",242,{"$f":"VLOOKUP(A1367,Municipios!$B$2:$B$223,1,FALSE)","v":"Burgos"}]
["Burgos","Cuenca","Burgos-hasta-Cuenca",379,{"$f":"VLOOKUP(A1368,Municipios!$B$2:$B$223,1,FALSE)","v":"Burgos"}]
["Burgos","Zamora","Burgos-hasta-Zamora",211,{"$f":"VLOOKUP(A1369,Municipios!$B$2:$B$223,1,FALSE)","v":"Burgos"}]
["Burgos","Córdoba","Burgos-hasta-Córdoba",633,{"$f":"VLOOKUP(A1370,Municipios!$B$2:$B$223,1,FALSE)","v":"Burgos"}]
["Burgos","Granada","Burgos-hasta-Granada",662,{"$f":"VLOOKUP(A1371,Municipios!$B$2:$B$223,1,FALSE)","v":"Burgos"}]
["Burgos","Pontevedra","Burgos-hasta-Pontevedra",431,{"$f":"VLOOKUP(A1372,Municipios!$B$2:$B$223,1,FALSE)","v":"Burgos"}]
["Burgos","Guadalajara","Burgos-hasta-Guadalajara",238,{"$f":"VLOOKUP(A1373,Municipios!$B$2:$B$223,1,FALSE)","v":"Burgos"}]
["Burgos","Coruña (A)","Burgos-hasta-Coruña (A)",501,{"$f":"VLOOKUP(A1374,Municipios!$B$2:$B$223,1,FALSE)","v":"Burgos"}]
["Burgos","Ciudad Real","Burgos-hasta-Ciudad Real",428,{"$f":"VLOOKUP(A1375,Municipios!$B$2:$B$223,1,FALSE)","v":"Burgos"}]
["Burgos","Castellón de la Plana/Castelló de la Plana","Burgos-hasta-Castellón de la Plana/Castelló de la Plana",533,{"$f":"VLOOKUP(A1376,Municipios!$B$2:$B$223,1,FALSE)","v":"Burgos"}]
["Burgos","Cádiz","Burgos-hasta-Cádiz",890,{"$f":"VLOOKUP(A1377,Municipios!$B$2:$B$223,1,FALSE)","v":"Burgos"}]
["Burgos","Huelva","Burgos-hasta-Huelva",862,{"$f":"VLOOKUP(A1378,Municipios!$B$2:$B$223,1,FALSE)","v":"Burgos"}]
["Burgos","Huesca","Burgos-hasta-Huesca",381,{"$f":"VLOOKUP(A1379,Municipios!$B$2:$B$223,1,FALSE)","v":"Burgos"}]
["Burgos","Jaén","Burgos-hasta-Jaén",570,{"$f":"VLOOKUP(A1380,Municipios!$B$2:$B$223,1,FALSE)","v":"Burgos"}]
["Burgos","Ourense","Burgos-hasta-Ourense",337,{"$f":"VLOOKUP(A1381,Municipios!$B$2:$B$223,1,FALSE)","v":"Burgos"}]
["Burgos","Pamplona/Iruña","Burgos-hasta-Pamplona/Iruña",198,{"$f":"VLOOKUP(A1382,Municipios!$B$2:$B$223,1,FALSE)","v":"Burgos"}]
["Burgos","Girona","Burgos-hasta-Girona",687,{"$f":"VLOOKUP(A1383,Municipios!$B$2:$B$223,1,FALSE)","v":"Burgos"}]
["Burgos","León","Burgos-hasta-León",188,{"$f":"VLOOKUP(A1384,Municipios!$B$2:$B$223,1,FALSE)","v":"Burgos"}]
["Burgos","Palencia","Burgos-hasta-Palencia",100,{"$f":"VLOOKUP(A1385,Municipios!$B$2:$B$223,1,FALSE)","v":"Burgos"}]
["Burgos","Oviedo","Burgos-hasta-Oviedo",306,{"$f":"VLOOKUP(A1386,Municipios!$B$2:$B$223,1,FALSE)","v":"Burgos"}]
["Burgos","Murcia","Burgos-hasta-Murcia",628,{"$f":"VLOOKUP(A1387,Municipios!$B$2:$B$223,1,FALSE)","v":"Burgos"}]
["Burgos","Málaga","Burgos-hasta-Málaga",793,{"$f":"VLOOKUP(A1388,Municipios!$B$2:$B$223,1,FALSE)","v":"Burgos"}]
["Burgos","Madrid","Burgos-hasta-Madrid",226,{"$f":"VLOOKUP(A1389,Municipios!$B$2:$B$223,1,FALSE)","v":"Burgos"}]
["Burgos","Lleida","Burgos-hasta-Lleida",484,{"$f":"VLOOKUP(A1390,Municipios!$B$2:$B$223,1,FALSE)","v":"Burgos"}]
["Burgos","Lugo","Burgos-hasta-Lugo",409,{"$f":"VLOOKUP(A1391,Municipios!$B$2:$B$223,1,FALSE)","v":"Burgos"}]
["Burgos","Logroño","Burgos-hasta-Logroño",135,{"$f":"VLOOKUP(A1392,Municipios!$B$2:$B$223,1,FALSE)","v":"Burgos"}]
["Cáceres","Donostia/San Sebastián","Cáceres-hasta-Donostia/San Sebastián",679,{"$f":"VLOOKUP(A1393,Municipios!$B$2:$B$223,1,FALSE)","v":"Cáceres"}]
["Cáceres","Zamora","Cáceres-hasta-Zamora",277,{"$f":"VLOOKUP(A1394,Municipios!$B$2:$B$223,1,FALSE)","v":"Cáceres"}]
["Cáceres","Segovia","Cáceres-hasta-Segovia",300,{"$f":"VLOOKUP(A1395,Municipios!$B$2:$B$223,1,FALSE)","v":"Cáceres"}]
["Cáceres","Sevilla","Cáceres-hasta-Sevilla",261,{"$f":"VLOOKUP(A1396,Municipios!$B$2:$B$223,1,FALSE)","v":"Cáceres"}]
["Cáceres","Soria","Cáceres-hasta-Soria",528,{"$f":"VLOOKUP(A1397,Municipios!$B$2:$B$223,1,FALSE)","v":"Cáceres"}]
["Cáceres","Tarragona","Cáceres-hasta-Tarragona",883,{"$f":"VLOOKUP(A1398,Municipios!$B$2:$B$223,1,FALSE)","v":"Cáceres"}]
["Cáceres","Santander","Cáceres-hasta-Santander",573,{"$f":"VLOOKUP(A1399,Municipios!$B$2:$B$223,1,FALSE)","v":"Cáceres"}]
["Cáceres","Teruel","Cáceres-hasta-Teruel",583,{"$f":"VLOOKUP(A1400,Municipios!$B$2:$B$223,1,FALSE)","v":"Cáceres"}]
["Cáceres","Toledo","Cáceres-hasta-Toledo",265,{"$f":"VLOOKUP(A1401,Municipios!$B$2:$B$223,1,FALSE)","v":"Cáceres"}]
["Cáceres","Valencia","Cáceres-hasta-Valencia",707,{"$f":"VLOOKUP(A1402,Municipios!$B$2:$B$223,1,FALSE)","v":"Cáceres"}]
["Cáceres","Vitoria/Gasteiz","Cáceres-hasta-Vitoria/Gasteiz",562,{"$f":"VLOOKUP(A1403,Municipios!$B$2:$B$223,1,FALSE)","v":"Cáceres"}]
["Cáceres","Zaragoza","Cáceres-hasta-Zaragoza",619,{"$f":"VLOOKUP(A1404,Municipios!$B$2:$B$223,1,FALSE)","v":"Cáceres"}]
["Cáceres","Salamanca","Cáceres-hasta-Salamanca",212,{"$f":"VLOOKUP(A1405,Municipios!$B$2:$B$223,1,FALSE)","v":"Cáceres"}]
["Cáceres","Lugo","Cáceres-hasta-Lugo",578,{"$f":"VLOOKUP(A1406,Municipios!$B$2:$B$223,1,FALSE)","v":"Cáceres"}]
["Cáceres","Valladolid",{"$f":"CONCATENATE(A1407,\"-hasta-\",B1407)","v":"Cáceres-hasta-Valladolid"},332,{"$f":"VLOOKUP(A1407,Municipios!$B$2:$B$223,1,FALSE)","v":"Cáceres"}]
["Cáceres","Jaén","Cáceres-hasta-Jaén",463,{"$f":"VLOOKUP(A1408,Municipios!$B$2:$B$223,1,FALSE)","v":"Cáceres"}]
["Cáceres","Cádiz","Cáceres-hasta-Cádiz",374,{"$f":"VLOOKUP(A1409,Municipios!$B$2:$B$223,1,FALSE)","v":"Cáceres"}]
["Cáceres","Castellón de la Plana/Castelló de la Plana","Cáceres-hasta-Castellón de la Plana/Castelló de la Plana",758,{"$f":"VLOOKUP(A1410,Municipios!$B$2:$B$223,1,FALSE)","v":"Cáceres"}]
["Cáceres","Ciudad Real","Cáceres-hasta-Ciudad Real",295,{"$f":"VLOOKUP(A1411,Municipios!$B$2:$B$223,1,FALSE)","v":"Cáceres"}]
["Cáceres","Córdoba","Cáceres-hasta-Córdoba",322,{"$f":"VLOOKUP(A1412,Municipios!$B$2:$B$223,1,FALSE)","v":"Cáceres"}]
["Cáceres","Coruña (A)","Cáceres-hasta-Coruña (A)",669,{"$f":"VLOOKUP(A1413,Municipios!$B$2:$B$223,1,FALSE)","v":"Cáceres"}]
["Cáceres","Cuenca","Cáceres-hasta-Cuenca",441,{"$f":"VLOOKUP(A1414,Municipios!$B$2:$B$223,1,FALSE)","v":"Cáceres"}]
["Cáceres","Girona","Cáceres-hasta-Girona",1001,{"$f":"VLOOKUP(A1415,Municipios!$B$2:$B$223,1,FALSE)","v":"Cáceres"}]
["Cáceres","Granada","Cáceres-hasta-Granada",553,{"$f":"VLOOKUP(A1416,Municipios!$B$2:$B$223,1,FALSE)","v":"Cáceres"}]
["Cáceres","Guadalajara","Cáceres-hasta-Guadalajara",358,{"$f":"VLOOKUP(A1417,Municipios!$B$2:$B$223,1,FALSE)","v":"Cáceres"}]
["Cáceres","Madrid","Cáceres-hasta-Madrid",297,{"$f":"VLOOKUP(A1418,Municipios!$B$2:$B$223,1,FALSE)","v":"Cáceres"}]
["Cáceres","Huesca","Cáceres-hasta-Huesca",689,{"$f":"VLOOKUP(A1419,Municipios!$B$2:$B$223,1,FALSE)","v":"Cáceres"}]
["Cáceres","Pontevedra","Cáceres-hasta-Pontevedra",658,{"$f":"VLOOKUP(A1420,Municipios!$B$2:$B$223,1,FALSE)","v":"Cáceres"}]
["Cáceres","León","Cáceres-hasta-León",413,{"$f":"VLOOKUP(A1421,Municipios!$B$2:$B$223,1,FALSE)","v":"Cáceres"}]
["Cáceres","Logroño","Cáceres-hasta-Logroño",479,{"$f":"VLOOKUP(A1422,Municipios!$B$2:$B$223,1,FALSE)","v":"Cáceres"}]
["Cáceres","Lleida","Cáceres-hasta-Lleida",779,{"$f":"VLOOKUP(A1423,Municipios!$B$2:$B$223,1,FALSE)","v":"Cáceres"}]
["Cáceres","Málaga","Cáceres-hasta-Málaga",461,{"$f":"VLOOKUP(A1424,Municipios!$B$2:$B$223,1,FALSE)","v":"Cáceres"}]
["Cáceres","Murcia","Cáceres-hasta-Murcia",655,{"$f":"VLOOKUP(A1425,Municipios!$B$2:$B$223,1,FALSE)","v":"Cáceres"}]
["Cáceres","Ourense","Cáceres-hasta-Ourense",570,{"$f":"VLOOKUP(A1426,Municipios!$B$2:$B$223,1,FALSE)","v":"Cáceres"}]
["Cáceres","Oviedo","Cáceres-hasta-Oviedo",532,{"$f":"VLOOKUP(A1427,Municipios!$B$2:$B$223,1,FALSE)","v":"Cáceres"}]
["Cáceres","Palencia","Cáceres-hasta-Palencia",375,{"$f":"VLOOKUP(A1428,Municipios!$B$2:$B$223,1,FALSE)","v":"Cáceres"}]
["Cáceres","Pamplona/Iruña","Cáceres-hasta-Pamplona/Iruña",652,{"$f":"VLOOKUP(A1429,Municipios!$B$2:$B$223,1,FALSE)","v":"Cáceres"}]
["Cáceres","Huelva","Cáceres-hasta-Huelva",346,{"$f":"VLOOKUP(A1430,Municipios!$B$2:$B$223,1,FALSE)","v":"Cáceres"}]
["Huesca","Albacete","Huesca-hasta-Albacete",477,{"$f":"VLOOKUP(A1431,Municipios!$B$2:$B$223,1,FALSE)","v":"Huesca"}]
["Pamplona/Iruña","Albacete","Pamplona/Iruña-hasta-Albacete",578,{"$f":"VLOOKUP(A1432,Municipios!$B$2:$B$223,1,FALSE)","v":"Pamplona/Iruña"}]
["Palencia","Albacete","Palencia-hasta-Albacete",525,{"$f":"VLOOKUP(A1433,Municipios!$B$2:$B$223,1,FALSE)","v":"Palencia"}]
["Oviedo","Albacete","Oviedo-hasta-Albacete",698,{"$f":"VLOOKUP(A1434,Municipios!$B$2:$B$223,1,FALSE)","v":"Oviedo"}]
["Almería","Albacete","Almería-hasta-Albacete",356,{"$f":"VLOOKUP(A1435,Municipios!$B$2:$B$223,1,FALSE)","v":"Almería"}]
["Ourense","Albacete","Ourense-hasta-Albacete",756,{"$f":"VLOOKUP(A1436,Municipios!$B$2:$B$223,1,FALSE)","v":"Ourense"}]
["Cádiz","Albacete","Cádiz-hasta-Albacete",600,{"$f":"VLOOKUP(A1437,Municipios!$B$2:$B$223,1,FALSE)","v":"Cádiz"}]
["Málaga","Albacete","Málaga-hasta-Albacete",508,{"$f":"VLOOKUP(A1438,Municipios!$B$2:$B$223,1,FALSE)","v":"Málaga"}]
["Lleida","Albacete","Lleida-hasta-Albacete",640,{"$f":"VLOOKUP(A1439,Municipios!$B$2:$B$223,1,FALSE)","v":"Lleida"}]
["Lugo","Albacete","Lugo-hasta-Albacete",750,{"$f":"VLOOKUP(A1440,Municipios!$B$2:$B$223,1,FALSE)","v":"Lugo"}]
["Logroño","Albacete","Logroño-hasta-Albacete",608,{"$f":"VLOOKUP(A1441,Municipios!$B$2:$B$223,1,FALSE)","v":"Logroño"}]
["Pontevedra","Albacete","Pontevedra-hasta-Albacete",862,{"$f":"VLOOKUP(A1442,Municipios!$B$2:$B$223,1,FALSE)","v":"Pontevedra"}]
["Jaén","Albacete","Jaén-hasta-Albacete",285,{"$f":"VLOOKUP(A1443,Municipios!$B$2:$B$223,1,FALSE)","v":"Jaén"}]
["Murcia","Albacete","Murcia-hasta-Albacete",145,{"$f":"VLOOKUP(A1444,Municipios!$B$2:$B$223,1,FALSE)","v":"Murcia"}]
["Alicante/Alacant","Albacete","Alicante/Alacant-hasta-Albacete",170,{"$f":"VLOOKUP(A1445,Municipios!$B$2:$B$223,1,FALSE)","v":"Alicante/Alacant"}]
["Huelva","Albacete","Huelva-hasta-Albacete",578,{"$f":"VLOOKUP(A1446,Municipios!$B$2:$B$223,1,FALSE)","v":"Huelva"}]
["Guadalajara","Albacete","Guadalajara-hasta-Albacete",299,{"$f":"VLOOKUP(A1447,Municipios!$B$2:$B$223,1,FALSE)","v":"Guadalajara"}]
["Granada","Albacete","Granada-hasta-Albacete",383,{"$f":"VLOOKUP(A1448,Municipios!$B$2:$B$223,1,FALSE)","v":"Granada"}]
["Girona","Albacete","Girona-hasta-Albacete",630,{"$f":"VLOOKUP(A1449,Municipios!$B$2:$B$223,1,FALSE)","v":"Girona"}]
["Cuenca","Albacete","Cuenca-hasta-Albacete",140,{"$f":"VLOOKUP(A1450,Municipios!$B$2:$B$223,1,FALSE)","v":"Cuenca"}]
["Coruña (A)","Albacete","Coruña (A)-hasta-Albacete",856,{"$f":"VLOOKUP(A1451,Municipios!$B$2:$B$223,1,FALSE)","v":"Coruña (A)"}]
["Córdoba","Albacete","Córdoba-hasta-Albacete",349,{"$f":"VLOOKUP(A1452,Municipios!$B$2:$B$223,1,FALSE)","v":"Córdoba"}]
["Ciudad Real","Albacete","Ciudad Real-hasta-Albacete",205,{"$f":"VLOOKUP(A1453,Municipios!$B$2:$B$223,1,FALSE)","v":"Ciudad Real"}]
["Castellón de la Plana/Castelló de la Plana","Albacete","Castellón de la Plana/Castelló de la Plana-hasta-Albacete",264,{"$f":"VLOOKUP(A1454,Municipios!$B$2:$B$223,1,FALSE)","v":"Castellón de la Plana/Castelló de la Plana"}]
["León","Albacete","León-hasta-Albacete",607,{"$f":"VLOOKUP(A1455,Municipios!$B$2:$B$223,1,FALSE)","v":"León"}]
["Burgos","Albacete","Burgos-hasta-Albacete",473,{"$f":"VLOOKUP(A1456,Municipios!$B$2:$B$223,1,FALSE)","v":"Burgos"}]
["Madrid","Albacete","Madrid-hasta-Albacete",247,{"$f":"VLOOKUP(A1457,Municipios!$B$2:$B$223,1,FALSE)","v":"Madrid"}]
["Cáceres","Albacete","Cáceres-hasta-Albacete",509,{"$f":"VLOOKUP(A1458,Municipios!$B$2:$B$223,1,FALSE)","v":"Cáceres"}]
["Salamanca","Albacete","Salamanca-hasta-Albacete",469,{"$f":"VLOOKUP(A1459,Municipios!$B$2:$B$223,1,FALSE)","v":"Salamanca"}]
["Bilbao","Albacete","Bilbao-hasta-Albacete",618,{"$f":"VLOOKUP(A1460,Municipios!$B$2:$B$223,1,FALSE)","v":"Bilbao"}]
["Barcelona","Albacete","Barcelona-hasta-Albacete",548,{"$f":"VLOOKUP(A1461,Municipios!$B$2:$B$223,1,FALSE)","v":"Barcelona"}]
["Badajoz","Albacete","Badajoz-hasta-Albacete",514,{"$f":"VLOOKUP(A1462,Municipios!$B$2:$B$223,1,FALSE)","v":"Badajoz"}]
["Zaragoza","Albacete","Zaragoza-hasta-Albacete",403,{"$f":"VLOOKUP(A1463,Municipios!$B$2:$B$223,1,FALSE)","v":"Zaragoza"}]
["Zamora","Albacete","Zamora-hasta-Albacete",513,{"$f":"VLOOKUP(A1464,Municipios!$B$2:$B$223,1,FALSE)","v":"Zamora"}]
["Vitoria-Gasteiz","Albacete","Vitoria-Gasteiz-hasta-Albacete",581,{"$f":"VLOOKUP(A1465,Municipios!$B$2:$B$223,1,FALSE)","v":"Vitoria-Gasteiz"}]
["Valladolid","Albacete","Valladolid-hasta-Albacete",477,{"$f":"VLOOKUP(A1466,Municipios!$B$2:$B$223,1,FALSE)","v":"Valladolid"}]
["Segovia","Albacete","Segovia-hasta-Albacete",356,{"$f":"VLOOKUP(A1467,Municipios!$B$2:$B$223,1,FALSE)","v":"Segovia"}]
["Valencia","Albacete","Valencia-hasta-Albacete",197,{"$f":"VLOOKUP(A1468,Municipios!$B$2:$B$223,1,FALSE)","v":"Valencia"}]
["Santander","Albacete","Santander-hasta-Albacete",640,{"$f":"VLOOKUP(A1469,Municipios!$B$2:$B$223,1,FALSE)","v":"Santander"}]
["Sevilla","Albacete","Sevilla-hasta-Albacete",487,{"$f":"VLOOKUP(A1470,Municipios!$B$2:$B$223,1,FALSE)","v":"Sevilla"}]
["Soria","Albacete",{"$f":"CONCATENATE(A1471,\"-hasta-\",B1471)","v":"Soria-hasta-Albacete"},410,{"$f":"VLOOKUP(A1471,Municipios!$B$2:$B$223,1,FALSE)","v":"Soria"}]
["Ávila","Albacete","Ávila-hasta-Albacete",376,{"$f":"VLOOKUP(A1472,Municipios!$B$2:$B$223,1,FALSE)","v":"Ávila"}]
["Tarragona","Albacete","Tarragona-hasta-Albacete",451,{"$f":"VLOOKUP(A1473,Municipios!$B$2:$B$223,1,FALSE)","v":"Tarragona"}]
["Teruel","Albacete","Teruel-hasta-Albacete",239,{"$f":"VLOOKUP(A1474,Municipios!$B$2:$B$223,1,FALSE)","v":"Teruel"}]
["Toledo","Albacete","Toledo-hasta-Albacete",287,{"$f":"VLOOKUP(A1475,Municipios!$B$2:$B$223,1,FALSE)","v":"Toledo"}]
["Donostia-San Sebastián","Albacete","Donostia-San Sebastián-hasta-Albacete",668,{"$f":"VLOOKUP(A1476,Municipios!$B$2:$B$223,1,FALSE)","v":"Donostia-San Sebastián"}]
["Oviedo","Cádiz","Oviedo-hasta-Cádiz",906,{"$f":"VLOOKUP(A1477,Municipios!$B$2:$B$223,1,FALSE)","v":"Oviedo"}]
["Zaragoza","Cádiz","Zaragoza-hasta-Cádiz",965,{"$f":"VLOOKUP(A1478,Municipios!$B$2:$B$223,1,FALSE)","v":"Zaragoza"}]
["Segovia","Cádiz","Segovia-hasta-Cádiz",751,{"$f":"VLOOKUP(A1479,Municipios!$B$2:$B$223,1,FALSE)","v":"Segovia"}]
["Palencia","Cádiz","Palencia-hasta-Cádiz",749,{"$f":"VLOOKUP(A1480,Municipios!$B$2:$B$223,1,FALSE)","v":"Palencia"}]
["Pamplona/Iruña","Cádiz","Pamplona/Iruña-hasta-Cádiz",1088,{"$f":"VLOOKUP(A1481,Municipios!$B$2:$B$223,1,FALSE)","v":"Pamplona/Iruña"}]
["Pontevedra","Cádiz","Pontevedra-hasta-Cádiz",1032,{"$f":"VLOOKUP(A1482,Municipios!$B$2:$B$223,1,FALSE)","v":"Pontevedra"}]
["Salamanca","Cádiz","Salamanca-hasta-Cádiz",586,{"$f":"VLOOKUP(A1483,Municipios!$B$2:$B$223,1,FALSE)","v":"Salamanca"}]
["Donostia-San Sebastián","Cádiz","Donostia-San Sebastián-hasta-Cádiz",1115,{"$f":"VLOOKUP(A1484,Municipios!$B$2:$B$223,1,FALSE)","v":"Donostia-San Sebastián"}]
["Santander","Cádiz","Santander-hasta-Cádiz",1053,{"$f":"VLOOKUP(A1485,Municipios!$B$2:$B$223,1,FALSE)","v":"Santander"}]
["Sevilla","Cádiz","Sevilla-hasta-Cádiz",113,{"$f":"VLOOKUP(A1486,Municipios!$B$2:$B$223,1,FALSE)","v":"Sevilla"}]
["Soria","Cádiz","Soria-hasta-Cádiz",874,{"$f":"VLOOKUP(A1487,Municipios!$B$2:$B$223,1,FALSE)","v":"Soria"}]
["Tarragona","Cádiz","Tarragona-hasta-Cádiz",1060,{"$f":"VLOOKUP(A1488,Municipios!$B$2:$B$223,1,FALSE)","v":"Tarragona"}]
["Teruel","Cádiz","Teruel-hasta-Cádiz",850,{"$f":"VLOOKUP(A1489,Municipios!$B$2:$B$223,1,FALSE)","v":"Teruel"}]
["Valladolid","Cádiz","Valladolid-hasta-Cádiz",707,{"$f":"VLOOKUP(A1490,Municipios!$B$2:$B$223,1,FALSE)","v":"Valladolid"}]
["Valencia","Cádiz","Valencia-hasta-Cádiz",805,{"$f":"VLOOKUP(A1491,Municipios!$B$2:$B$223,1,FALSE)","v":"Valencia"}]
["Zamora","Cádiz","Zamora-hasta-Cádiz",652,{"$f":"VLOOKUP(A1492,Municipios!$B$2:$B$223,1,FALSE)","v":"Zamora"}]
["Vitoria-Gasteiz","Cádiz","Vitoria-Gasteiz-hasta-Cádiz",998,{"$f":"VLOOKUP(A1493,Municipios!$B$2:$B$223,1,FALSE)","v":"Vitoria-Gasteiz"}]
["Ourense","Cádiz","Ourense-hasta-Cádiz",944,{"$f":"VLOOKUP(A1494,Municipios!$B$2:$B$223,1,FALSE)","v":"Ourense"}]
["Toledo","Cádiz","Toledo-hasta-Cádiz",564,{"$f":"VLOOKUP(A1495,Municipios!$B$2:$B$223,1,FALSE)","v":"Toledo"}]
["Córdoba","Cádiz","Córdoba-hasta-Cádiz",257,{"$f":"VLOOKUP(A1496,Municipios!$B$2:$B$223,1,FALSE)","v":"Córdoba"}]
["Girona","Cádiz","Girona-hasta-Cádiz",1239,{"$f":"VLOOKUP(A1497,Municipios!$B$2:$B$223,1,FALSE)","v":"Girona"}]
["Coruña (A)","Cádiz","Coruña (A)-hasta-Cádiz",1044,{"$f":"VLOOKUP(A1498,Municipios!$B$2:$B$223,1,FALSE)","v":"Coruña (A)"}]
["Murcia","Cádiz","Murcia-hasta-Cádiz",691,{"$f":"VLOOKUP(A1499,Municipios!$B$2:$B$223,1,FALSE)","v":"Murcia"}]
["Ciudad Real","Cádiz","Ciudad Real-hasta-Cádiz",439,{"$f":"VLOOKUP(A1500,Municipios!$B$2:$B$223,1,FALSE)","v":"Ciudad Real"}]
["Castellón de la Plana/Castelló de la Plana","Cádiz","Castellón de la Plana/Castelló de la Plana-hasta-Cádiz",872,{"$f":"VLOOKUP(A1501,Municipios!$B$2:$B$223,1,FALSE)","v":"Castellón de la Plana/Castelló de la Plana"}]
["Cuenca","Cádiz","Cuenca-hasta-Cádiz",708,{"$f":"VLOOKUP(A1502,Municipios!$B$2:$B$223,1,FALSE)","v":"Cuenca"}]
["Granada","Cádiz","Granada-hasta-Cádiz",407,{"$f":"VLOOKUP(A1503,Municipios!$B$2:$B$223,1,FALSE)","v":"Granada"}]
["Guadalajara","Cádiz","Guadalajara-hasta-Cádiz",705,{"$f":"VLOOKUP(A1504,Municipios!$B$2:$B$223,1,FALSE)","v":"Guadalajara"}]
["Lleida","Cádiz","Lleida-hasta-Cádiz",1137,{"$f":"VLOOKUP(A1505,Municipios!$B$2:$B$223,1,FALSE)","v":"Lleida"}]
["Huelva","Cádiz","Huelva-hasta-Cádiz",199,{"$f":"VLOOKUP(A1506,Municipios!$B$2:$B$223,1,FALSE)","v":"Huelva"}]
["Madrid","Cádiz","Madrid-hasta-Cádiz",648,{"$f":"VLOOKUP(A1507,Municipios!$B$2:$B$223,1,FALSE)","v":"Madrid"}]
["Lugo","Cádiz","Lugo-hasta-Cádiz",952,{"$f":"VLOOKUP(A1508,Municipios!$B$2:$B$223,1,FALSE)","v":"Lugo"}]
["Logroño","Cádiz","Logroño-hasta-Cádiz",1033,{"$f":"VLOOKUP(A1509,Municipios!$B$2:$B$223,1,FALSE)","v":"Logroño"}]
["León","Cádiz","León-hasta-Cádiz",788,{"$f":"VLOOKUP(A1510,Municipios!$B$2:$B$223,1,FALSE)","v":"León"}]
["Jaén","Cádiz","Jaén-hasta-Cádiz",391,{"$f":"VLOOKUP(A1511,Municipios!$B$2:$B$223,1,FALSE)","v":"Jaén"}]
["Huesca","Cádiz","Huesca-hasta-Cádiz",1036,{"$f":"VLOOKUP(A1512,Municipios!$B$2:$B$223,1,FALSE)","v":"Huesca"}]
["Málaga","Cádiz","Málaga-hasta-Cádiz",265,{"$f":"VLOOKUP(A1513,Municipios!$B$2:$B$223,1,FALSE)","v":"Málaga"}]
["Pamplona/Iruña","Castellón de la Plana/Castelló de la Plana","Pamplona/Iruña-hasta-Castellón de la Plana/Castelló de la Plana",519,{"$f":"VLOOKUP(A1514,Municipios!$B$2:$B$223,1,FALSE)","v":"Pamplona/Iruña"}]
["Palencia","Castellón de la Plana/Castelló de la Plana","Palencia-hasta-Castellón de la Plana/Castelló de la Plana",607,{"$f":"VLOOKUP(A1515,Municipios!$B$2:$B$223,1,FALSE)","v":"Palencia"}]
["Valladolid","Castellón de la Plana/Castelló de la Plana","Valladolid-hasta-Castellón de la Plana/Castelló de la Plana",649,{"$f":"VLOOKUP(A1516,Municipios!$B$2:$B$223,1,FALSE)","v":"Valladolid"}]
["Sevilla","Castellón de la Plana/Castelló de la Plana","Sevilla-hasta-Castellón de la Plana/Castelló de la Plana",753,{"$f":"VLOOKUP(A1517,Municipios!$B$2:$B$223,1,FALSE)","v":"Sevilla"}]
["Pontevedra","Castellón de la Plana/Castelló de la Plana","Pontevedra-hasta-Castellón de la Plana/Castelló de la Plana",1034,{"$f":"VLOOKUP(A1518,Municipios!$B$2:$B$223,1,FALSE)","v":"Pontevedra"}]
["Salamanca","Castellón de la Plana/Castelló de la Plana","Salamanca-hasta-Castellón de la Plana/Castelló de la Plana",650,{"$f":"VLOOKUP(A1519,Municipios!$B$2:$B$223,1,FALSE)","v":"Salamanca"}]
["Donostia-San Sebastián","Castellón de la Plana/Castelló de la Plana","Donostia-San Sebastián-hasta-Castellón de la Plana/Castelló de la Plana",609,{"$f":"VLOOKUP(A1520,Municipios!$B$2:$B$223,1,FALSE)","v":"Donostia-San Sebastián"}]
["Santander","Castellón de la Plana/Castelló de la Plana","Santander-hasta-Castellón de la Plana/Castelló de la Plana",738,{"$f":"VLOOKUP(A1521,Municipios!$B$2:$B$223,1,FALSE)","v":"Santander"}]
["Segovia","Castellón de la Plana/Castelló de la Plana","Segovia-hasta-Castellón de la Plana/Castelló de la Plana",537,{"$f":"VLOOKUP(A1522,Municipios!$B$2:$B$223,1,FALSE)","v":"Segovia"}]
["Soria","Castellón de la Plana/Castelló de la Plana","Soria-hasta-Castellón de la Plana/Castelló de la Plana",385,{"$f":"VLOOKUP(A1523,Municipios!$B$2:$B$223,1,FALSE)","v":"Soria"}]
["Tarragona","Castellón de la Plana/Castelló de la Plana","Tarragona-hasta-Castellón de la Plana/Castelló de la Plana",178,{"$f":"VLOOKUP(A1524,Municipios!$B$2:$B$223,1,FALSE)","v":"Tarragona"}]
["Teruel","Castellón de la Plana/Castelló de la Plana","Teruel-hasta-Castellón de la Plana/Castelló de la Plana",163,{"$f":"VLOOKUP(A1525,Municipios!$B$2:$B$223,1,FALSE)","v":"Teruel"}]
["Zaragoza","Castellón de la Plana/Castelló de la Plana","Zaragoza-hasta-Castellón de la Plana/Castelló de la Plana",344,{"$f":"VLOOKUP(A1526,Municipios!$B$2:$B$223,1,FALSE)","v":"Zaragoza"}]
["Valencia","Castellón de la Plana/Castelló de la Plana","Valencia-hasta-Castellón de la Plana/Castelló de la Plana",67,{"$f":"VLOOKUP(A1527,Municipios!$B$2:$B$223,1,FALSE)","v":"Valencia"}]
["Vitoria-Gasteiz","Castellón de la Plana/Castelló de la Plana","Vitoria-Gasteiz-hasta-Castellón de la Plana/Castelló de la Plana",604,{"$f":"VLOOKUP(A1528,Municipios!$B$2:$B$223,1,FALSE)","v":"Vitoria-Gasteiz"}]
["Zamora","Castellón de la Plana/Castelló de la Plana","Zamora-hasta-Castellón de la Plana/Castelló de la Plana",696,{"$f":"VLOOKUP(A1529,Municipios!$B$2:$B$223,1,FALSE)","v":"Zamora"}]
["Huesca","Castellón de la Plana/Castelló de la Plana","Huesca-hasta-Castellón de la Plana/Castelló de la Plana",418,{"$f":"VLOOKUP(A1530,Municipios!$B$2:$B$223,1,FALSE)","v":"Huesca"}]
["Oviedo","Castellón de la Plana/Castelló de la Plana","Oviedo-hasta-Castellón de la Plana/Castelló de la Plana",880,{"$f":"VLOOKUP(A1531,Municipios!$B$2:$B$223,1,FALSE)","v":"Oviedo"}]
["Toledo","Castellón de la Plana/Castelló de la Plana","Toledo-hasta-Castellón de la Plana/Castelló de la Plana",429,{"$f":"VLOOKUP(A1532,Municipios!$B$2:$B$223,1,FALSE)","v":"Toledo"}]
["Córdoba","Castellón de la Plana/Castelló de la Plana","Córdoba-hasta-Castellón de la Plana/Castelló de la Plana",615,{"$f":"VLOOKUP(A1533,Municipios!$B$2:$B$223,1,FALSE)","v":"Córdoba"}]
["Ourense","Castellón de la Plana/Castelló de la Plana","Ourense-hasta-Castellón de la Plana/Castelló de la Plana",928,{"$f":"VLOOKUP(A1534,Municipios!$B$2:$B$223,1,FALSE)","v":"Ourense"}]
["León","Castellón de la Plana/Castelló de la Plana",{"$f":"CONCATENATE(A1535,\"-hasta-\",B1535)","v":"León-hasta-Castellón de la Plana/Castelló de la Plana"},782,{"$f":"VLOOKUP(A1535,Municipios!$B$2:$B$223,1,FALSE)","v":"León"}]
["Ciudad Real","Castellón de la Plana/Castelló de la Plana","Ciudad Real-hasta-Castellón de la Plana/Castelló de la Plana",372,{"$f":"VLOOKUP(A1536,Municipios!$B$2:$B$223,1,FALSE)","v":"Ciudad Real"}]
["Coruña (A)","Castellón de la Plana/Castelló de la Plana","Coruña (A)-hasta-Castellón de la Plana/Castelló de la Plana",1028,{"$f":"VLOOKUP(A1537,Municipios!$B$2:$B$223,1,FALSE)","v":"Coruña (A)"}]
["Cuenca","Castellón de la Plana/Castelló de la Plana","Cuenca-hasta-Castellón de la Plana/Castelló de la Plana",308,{"$f":"VLOOKUP(A1538,Municipios!$B$2:$B$223,1,FALSE)","v":"Cuenca"}]
["Girona","Castellón de la Plana/Castelló de la Plana","Girona-hasta-Castellón de la Plana/Castelló de la Plana",359,{"$f":"VLOOKUP(A1539,Municipios!$B$2:$B$223,1,FALSE)","v":"Girona"}]
["Granada","Castellón de la Plana/Castelló de la Plana","Granada-hasta-Castellón de la Plana/Castelló de la Plana",669,{"$f":"VLOOKUP(A1540,Municipios!$B$2:$B$223,1,FALSE)","v":"Granada"}]
["Guadalajara","Castellón de la Plana/Castelló de la Plana","Guadalajara-hasta-Castellón de la Plana/Castelló de la Plana",414,{"$f":"VLOOKUP(A1541,Municipios!$B$2:$B$223,1,FALSE)","v":"Guadalajara"}]
["Huelva","Castellón de la Plana/Castelló de la Plana","Huelva-hasta-Castellón de la Plana/Castelló de la Plana",844,{"$f":"VLOOKUP(A1542,Municipios!$B$2:$B$223,1,FALSE)","v":"Huelva"}]
["Jaén","Castellón de la Plana/Castelló de la Plana","Jaén-hasta-Castellón de la Plana/Castelló de la Plana",551,{"$f":"VLOOKUP(A1543,Municipios!$B$2:$B$223,1,FALSE)","v":"Jaén"}]
["Logroño","Castellón de la Plana/Castelló de la Plana","Logroño-hasta-Castellón de la Plana/Castelló de la Plana",588,{"$f":"VLOOKUP(A1544,Municipios!$B$2:$B$223,1,FALSE)","v":"Logroño"}]
["Lugo","Castellón de la Plana/Castelló de la Plana","Lugo-hasta-Castellón de la Plana/Castelló de la Plana",940,{"$f":"VLOOKUP(A1545,Municipios!$B$2:$B$223,1,FALSE)","v":"Lugo"}]
["Lleida","Castellón de la Plana/Castelló de la Plana","Lleida-hasta-Castellón de la Plana/Castelló de la Plana",312,{"$f":"VLOOKUP(A1546,Municipios!$B$2:$B$223,1,FALSE)","v":"Lleida"}]
["Madrid","Castellón de la Plana/Castelló de la Plana","Madrid-hasta-Castellón de la Plana/Castelló de la Plana",419,{"$f":"VLOOKUP(A1547,Municipios!$B$2:$B$223,1,FALSE)","v":"Madrid"}]
["Murcia","Castellón de la Plana/Castelló de la Plana","Murcia-hasta-Castellón de la Plana/Castelló de la Plana",331,{"$f":"VLOOKUP(A1548,Municipios!$B$2:$B$223,1,FALSE)","v":"Murcia"}]
["Málaga","Castellón de la Plana/Castelló de la Plana","Málaga-hasta-Castellón de la Plana/Castelló de la Plana",734,{"$f":"VLOOKUP(A1549,Municipios!$B$2:$B$223,1,FALSE)","v":"Málaga"}]
["Toledo","Ciudad Real","Toledo-hasta-Ciudad Real",117,{"$f":"VLOOKUP(A1550,Municipios!$B$2:$B$223,1,FALSE)","v":"Toledo"}]
["Palencia","Ciudad Real","Palencia-hasta-Ciudad Real",454,{"$f":"VLOOKUP(A1551,Municipios!$B$2:$B$223,1,FALSE)","v":"Palencia"}]
["Pamplona/Iruña","Ciudad Real","Pamplona/Iruña-hasta-Ciudad Real",608,{"$f":"VLOOKUP(A1552,Municipios!$B$2:$B$223,1,FALSE)","v":"Pamplona/Iruña"}]
["Pontevedra","Ciudad Real","Pontevedra-hasta-Ciudad Real",779,{"$f":"VLOOKUP(A1553,Municipios!$B$2:$B$223,1,FALSE)","v":"Pontevedra"}]
["Salamanca","Ciudad Real","Salamanca-hasta-Ciudad Real",399,{"$f":"VLOOKUP(A1554,Municipios!$B$2:$B$223,1,FALSE)","v":"Salamanca"}]
["Donostia-San Sebastián","Ciudad Real","Donostia-San Sebastián-hasta-Ciudad Real",653,{"$f":"VLOOKUP(A1555,Municipios!$B$2:$B$223,1,FALSE)","v":"Donostia-San Sebastián"}]
["Segovia","Ciudad Real","Segovia-hasta-Ciudad Real",285,{"$f":"VLOOKUP(A1556,Municipios!$B$2:$B$223,1,FALSE)","v":"Segovia"}]
["Soria","Ciudad Real","Soria-hasta-Ciudad Real",414,{"$f":"VLOOKUP(A1557,Municipios!$B$2:$B$223,1,FALSE)","v":"Soria"}]
["Vitoria-Gasteiz","Ciudad Real","Vitoria-Gasteiz-hasta-Ciudad Real",536,{"$f":"VLOOKUP(A1558,Municipios!$B$2:$B$223,1,FALSE)","v":"Vitoria-Gasteiz"}]
["Teruel","Ciudad Real","Teruel-hasta-Ciudad Real",343,{"$f":"VLOOKUP(A1559,Municipios!$B$2:$B$223,1,FALSE)","v":"Teruel"}]
["Zamora","Ciudad Real","Zamora-hasta-Ciudad Real",444,{"$f":"VLOOKUP(A1560,Municipios!$B$2:$B$223,1,FALSE)","v":"Zamora"}]
["Valencia","Ciudad Real","Valencia-hasta-Ciudad Real",316,{"$f":"VLOOKUP(A1561,Municipios!$B$2:$B$223,1,FALSE)","v":"Valencia"}]
["Valladolid","Ciudad Real","Valladolid-hasta-Ciudad Real",405,{"$f":"VLOOKUP(A1562,Municipios!$B$2:$B$223,1,FALSE)","v":"Valladolid"}]
["Oviedo","Ciudad Real","Oviedo-hasta-Ciudad Real",629,{"$f":"VLOOKUP(A1563,Municipios!$B$2:$B$223,1,FALSE)","v":"Oviedo"}]
["Santander","Ciudad Real","Santander-hasta-Ciudad Real",590,{"$f":"VLOOKUP(A1564,Municipios!$B$2:$B$223,1,FALSE)","v":"Santander"}]
["Zaragoza","Ciudad Real","Zaragoza-hasta-Ciudad Real",505,{"$f":"VLOOKUP(A1565,Municipios!$B$2:$B$223,1,FALSE)","v":"Zaragoza"}]
["Tarragona","Ciudad Real","Tarragona-hasta-Ciudad Real",582,{"$f":"VLOOKUP(A1566,Municipios!$B$2:$B$223,1,FALSE)","v":"Tarragona"}]
["Guadalajara","Ciudad Real","Guadalajara-hasta-Ciudad Real",246,{"$f":"VLOOKUP(A1567,Municipios!$B$2:$B$223,1,FALSE)","v":"Guadalajara"}]
["Sevilla","Ciudad Real","Sevilla-hasta-Ciudad Real",320,{"$f":"VLOOKUP(A1568,Municipios!$B$2:$B$223,1,FALSE)","v":"Sevilla"}]
["Coruña (A)","Ciudad Real","Coruña (A)-hasta-Ciudad Real",785,{"$f":"VLOOKUP(A1569,Municipios!$B$2:$B$223,1,FALSE)","v":"Coruña (A)"}]
["Cuenca","Ciudad Real","Cuenca-hasta-Ciudad Real",195,{"$f":"VLOOKUP(A1570,Municipios!$B$2:$B$223,1,FALSE)","v":"Cuenca"}]
["Ourense","Ciudad Real","Ourense-hasta-Ciudad Real",685,{"$f":"VLOOKUP(A1571,Municipios!$B$2:$B$223,1,FALSE)","v":"Ourense"}]
["Granada","Ciudad Real","Granada-hasta-Ciudad Real",295,{"$f":"VLOOKUP(A1572,Municipios!$B$2:$B$223,1,FALSE)","v":"Granada"}]
["Córdoba","Ciudad Real","Córdoba-hasta-Ciudad Real",183,{"$f":"VLOOKUP(A1573,Municipios!$B$2:$B$223,1,FALSE)","v":"Córdoba"}]
["Huelva","Ciudad Real","Huelva-hasta-Ciudad Real",411,{"$f":"VLOOKUP(A1574,Municipios!$B$2:$B$223,1,FALSE)","v":"Huelva"}]
["Huesca","Ciudad Real","Huesca-hasta-Ciudad Real",576,{"$f":"VLOOKUP(A1575,Municipios!$B$2:$B$223,1,FALSE)","v":"Huesca"}]
["León","Ciudad Real","León-hasta-Ciudad Real",531,{"$f":"VLOOKUP(A1576,Municipios!$B$2:$B$223,1,FALSE)","v":"León"}]
["Logroño","Ciudad Real","Logroño-hasta-Ciudad Real",571,{"$f":"VLOOKUP(A1577,Municipios!$B$2:$B$223,1,FALSE)","v":"Logroño"}]
["Lugo","Ciudad Real","Lugo-hasta-Ciudad Real",697,{"$f":"VLOOKUP(A1578,Municipios!$B$2:$B$223,1,FALSE)","v":"Lugo"}]
["Lleida","Ciudad Real","Lleida-hasta-Ciudad Real",666,{"$f":"VLOOKUP(A1579,Municipios!$B$2:$B$223,1,FALSE)","v":"Lleida"}]
["Madrid","Ciudad Real","Madrid-hasta-Ciudad Real",184,{"$f":"VLOOKUP(A1580,Municipios!$B$2:$B$223,1,FALSE)","v":"Madrid"}]
["Málaga","Ciudad Real","Málaga-hasta-Ciudad Real",342,{"$f":"VLOOKUP(A1581,Municipios!$B$2:$B$223,1,FALSE)","v":"Málaga"}]
["Jaén","Ciudad Real","Jaén-hasta-Ciudad Real",213,{"$f":"VLOOKUP(A1582,Municipios!$B$2:$B$223,1,FALSE)","v":"Jaén"}]
["Girona","Ciudad Real","Girona-hasta-Ciudad Real",761,{"$f":"VLOOKUP(A1583,Municipios!$B$2:$B$223,1,FALSE)","v":"Girona"}]
["Murcia","Ciudad Real","Murcia-hasta-Ciudad Real",352,{"$f":"VLOOKUP(A1584,Municipios!$B$2:$B$223,1,FALSE)","v":"Murcia"}]
["Palencia","Córdoba","Palencia-hasta-Córdoba",661,{"$f":"VLOOKUP(A1585,Municipios!$B$2:$B$223,1,FALSE)","v":"Palencia"}]
["Segovia","Córdoba","Segovia-hasta-Córdoba",494,{"$f":"VLOOKUP(A1586,Municipios!$B$2:$B$223,1,FALSE)","v":"Segovia"}]
["Santander","Córdoba","Santander-hasta-Córdoba",795,{"$f":"VLOOKUP(A1587,Municipios!$B$2:$B$223,1,FALSE)","v":"Santander"}]
["Donostia-San Sebastián","Córdoba","Donostia-San Sebastián-hasta-Córdoba",858,{"$f":"VLOOKUP(A1588,Municipios!$B$2:$B$223,1,FALSE)","v":"Donostia-San Sebastián"}]
["Salamanca","Córdoba","Salamanca-hasta-Córdoba",535,{"$f":"VLOOKUP(A1589,Municipios!$B$2:$B$223,1,FALSE)","v":"Salamanca"}]
["Pamplona/Iruña","Córdoba","Pamplona/Iruña-hasta-Córdoba",815,{"$f":"VLOOKUP(A1590,Municipios!$B$2:$B$223,1,FALSE)","v":"Pamplona/Iruña"}]
["Pontevedra","Córdoba","Pontevedra-hasta-Córdoba",998,{"$f":"VLOOKUP(A1591,Municipios!$B$2:$B$223,1,FALSE)","v":"Pontevedra"}]
["Sevilla","Córdoba","Sevilla-hasta-Córdoba",138,{"$f":"VLOOKUP(A1592,Municipios!$B$2:$B$223,1,FALSE)","v":"Sevilla"}]
["Soria","Córdoba","Soria-hasta-Córdoba",618,{"$f":"VLOOKUP(A1593,Municipios!$B$2:$B$223,1,FALSE)","v":"Soria"}]
["Tarragona","Córdoba","Tarragona-hasta-Córdoba",803,{"$f":"VLOOKUP(A1594,Municipios!$B$2:$B$223,1,FALSE)","v":"Tarragona"}]
["Teruel","Córdoba","Teruel-hasta-Córdoba",593,{"$f":"VLOOKUP(A1595,Municipios!$B$2:$B$223,1,FALSE)","v":"Teruel"}]
["Toledo","Córdoba","Toledo-hasta-Córdoba",307,{"$f":"VLOOKUP(A1596,Municipios!$B$2:$B$223,1,FALSE)","v":"Toledo"}]
["Oviedo","Córdoba","Oviedo-hasta-Córdoba",837,{"$f":"VLOOKUP(A1597,Municipios!$B$2:$B$223,1,FALSE)","v":"Oviedo"}]
["Vitoria-Gasteiz","Córdoba","Vitoria-Gasteiz-hasta-Córdoba",741,{"$f":"VLOOKUP(A1598,Municipios!$B$2:$B$223,1,FALSE)","v":"Vitoria-Gasteiz"}]
["Huelva","Córdoba",{"$f":"CONCATENATE(A1599,\"-hasta-\",B1599)","v":"Huelva-hasta-Córdoba"},229,{"$f":"VLOOKUP(A1599,Municipios!$B$2:$B$223,1,FALSE)","v":"Huelva"}]
["Valencia","Córdoba","Valencia-hasta-Córdoba",548,{"$f":"VLOOKUP(A1600,Municipios!$B$2:$B$223,1,FALSE)","v":"Valencia"}]
["León","Córdoba","León-hasta-Córdoba",739,{"$f":"VLOOKUP(A1601,Municipios!$B$2:$B$223,1,FALSE)","v":"León"}]
["Zamora","Córdoba","Zamora-hasta-Córdoba",600,{"$f":"VLOOKUP(A1602,Municipios!$B$2:$B$223,1,FALSE)","v":"Zamora"}]
["Zaragoza","Córdoba","Zaragoza-hasta-Córdoba",709,{"$f":"VLOOKUP(A1603,Municipios!$B$2:$B$223,1,FALSE)","v":"Zaragoza"}]
["Coruña (A)","Córdoba","Coruña (A)-hasta-Córdoba",995,{"$f":"VLOOKUP(A1604,Municipios!$B$2:$B$223,1,FALSE)","v":"Coruña (A)"}]
["Cuenca","Córdoba","Cuenca-hasta-Córdoba",451,{"$f":"VLOOKUP(A1605,Municipios!$B$2:$B$223,1,FALSE)","v":"Cuenca"}]
["Girona","Córdoba","Girona-hasta-Córdoba",982,{"$f":"VLOOKUP(A1606,Municipios!$B$2:$B$223,1,FALSE)","v":"Girona"}]
["Granada","Córdoba","Granada-hasta-Córdoba",231,{"$f":"VLOOKUP(A1607,Municipios!$B$2:$B$223,1,FALSE)","v":"Granada"}]
["Jaén","Córdoba","Jaén-hasta-Córdoba",104,{"$f":"VLOOKUP(A1608,Municipios!$B$2:$B$223,1,FALSE)","v":"Jaén"}]
["Huesca","Córdoba","Huesca-hasta-Córdoba",779,{"$f":"VLOOKUP(A1609,Municipios!$B$2:$B$223,1,FALSE)","v":"Huesca"}]
["Ourense","Córdoba","Ourense-hasta-Córdoba",893,{"$f":"VLOOKUP(A1610,Municipios!$B$2:$B$223,1,FALSE)","v":"Ourense"}]
["Logroño","Córdoba","Logroño-hasta-Córdoba",776,{"$f":"VLOOKUP(A1611,Municipios!$B$2:$B$223,1,FALSE)","v":"Logroño"}]
["Lugo","Córdoba","Lugo-hasta-Córdoba",907,{"$f":"VLOOKUP(A1612,Municipios!$B$2:$B$223,1,FALSE)","v":"Lugo"}]
["Lleida","Córdoba","Lleida-hasta-Córdoba",869,{"$f":"VLOOKUP(A1613,Municipios!$B$2:$B$223,1,FALSE)","v":"Lleida"}]
["Madrid","Córdoba","Madrid-hasta-Córdoba",391,{"$f":"VLOOKUP(A1614,Municipios!$B$2:$B$223,1,FALSE)","v":"Madrid"}]
["Málaga","Córdoba","Málaga-hasta-Córdoba",159,{"$f":"VLOOKUP(A1615,Municipios!$B$2:$B$223,1,FALSE)","v":"Málaga"}]
["Murcia","Córdoba","Murcia-hasta-Córdoba",496,{"$f":"VLOOKUP(A1616,Municipios!$B$2:$B$223,1,FALSE)","v":"Murcia"}]
["Guadalajara","Córdoba","Guadalajara-hasta-Córdoba",448,{"$f":"VLOOKUP(A1617,Municipios!$B$2:$B$223,1,FALSE)","v":"Guadalajara"}]
["Valladolid","Córdoba","Valladolid-hasta-Córdoba",613,{"$f":"VLOOKUP(A1618,Municipios!$B$2:$B$223,1,FALSE)","v":"Valladolid"}]
["Lleida","Coruña (A)","Lleida-hasta-Coruña (A)",991,{"$f":"VLOOKUP(A1619,Municipios!$B$2:$B$223,1,FALSE)","v":"Lleida"}]
["Donostia-San Sebastián","Coruña (A)","Donostia-San Sebastián-hasta-Coruña (A)",699,{"$f":"VLOOKUP(A1620,Municipios!$B$2:$B$223,1,FALSE)","v":"Donostia-San Sebastián"}]
["Salamanca","Coruña (A)","Salamanca-hasta-Coruña (A)",461,{"$f":"VLOOKUP(A1621,Municipios!$B$2:$B$223,1,FALSE)","v":"Salamanca"}]
["Pontevedra","Coruña (A)","Pontevedra-hasta-Coruña (A)",132,{"$f":"VLOOKUP(A1622,Municipios!$B$2:$B$223,1,FALSE)","v":"Pontevedra"}]
["Pamplona/Iruña","Coruña (A)","Pamplona/Iruña-hasta-Coruña (A)",789,{"$f":"VLOOKUP(A1623,Municipios!$B$2:$B$223,1,FALSE)","v":"Pamplona/Iruña"}]
["Palencia","Coruña (A)","Palencia-hasta-Coruña (A)",434,{"$f":"VLOOKUP(A1624,Municipios!$B$2:$B$223,1,FALSE)","v":"Palencia"}]
["Oviedo","Coruña (A)","Oviedo-hasta-Coruña (A)",301,{"$f":"VLOOKUP(A1625,Municipios!$B$2:$B$223,1,FALSE)","v":"Oviedo"}]
["Ourense","Coruña (A)","Ourense-hasta-Coruña (A)",238,{"$f":"VLOOKUP(A1626,Municipios!$B$2:$B$223,1,FALSE)","v":"Ourense"}]
["Murcia","Coruña (A)","Murcia-hasta-Coruña (A)",997,{"$f":"VLOOKUP(A1627,Municipios!$B$2:$B$223,1,FALSE)","v":"Murcia"}]
["Santander","Coruña (A)","Santander-hasta-Coruña (A)",494,{"$f":"VLOOKUP(A1628,Municipios!$B$2:$B$223,1,FALSE)","v":"Santander"}]
["Madrid","Coruña (A)","Madrid-hasta-Coruña (A)",590,{"$f":"VLOOKUP(A1629,Municipios!$B$2:$B$223,1,FALSE)","v":"Madrid"}]
["Huelva","Coruña (A)","Huelva-hasta-Coruña (A)",1016,{"$f":"VLOOKUP(A1630,Municipios!$B$2:$B$223,1,FALSE)","v":"Huelva"}]
["Lugo","Coruña (A)","Lugo-hasta-Coruña (A)",88,{"$f":"VLOOKUP(A1631,Municipios!$B$2:$B$223,1,FALSE)","v":"Lugo"}]
["Logroño","Coruña (A)","Logroño-hasta-Coruña (A)",641,{"$f":"VLOOKUP(A1632,Municipios!$B$2:$B$223,1,FALSE)","v":"Logroño"}]
["León","Coruña (A)","León-hasta-Coruña (A)",308,{"$f":"VLOOKUP(A1633,Municipios!$B$2:$B$223,1,FALSE)","v":"León"}]
["Jaén","Coruña (A)","Jaén-hasta-Coruña (A)",928,{"$f":"VLOOKUP(A1634,Municipios!$B$2:$B$223,1,FALSE)","v":"Jaén"}]
["Huesca","Coruña (A)","Huesca-hasta-Coruña (A)",887,{"$f":"VLOOKUP(A1635,Municipios!$B$2:$B$223,1,FALSE)","v":"Huesca"}]
["Guadalajara","Coruña (A)","Guadalajara-hasta-Coruña (A)",649,{"$f":"VLOOKUP(A1636,Municipios!$B$2:$B$223,1,FALSE)","v":"Guadalajara"}]
["Girona","Coruña (A)","Girona-hasta-Coruña (A)",1195,{"$f":"VLOOKUP(A1637,Municipios!$B$2:$B$223,1,FALSE)","v":"Girona"}]
["Cuenca","Coruña (A)","Cuenca-hasta-Coruña (A)",779,{"$f":"VLOOKUP(A1638,Municipios!$B$2:$B$223,1,FALSE)","v":"Cuenca"}]
["Málaga","Coruña (A)","Málaga-hasta-Coruña (A)",1130,{"$f":"VLOOKUP(A1639,Municipios!$B$2:$B$223,1,FALSE)","v":"Málaga"}]
["Vitoria-Gasteiz","Coruña (A)","Vitoria-Gasteiz-hasta-Coruña (A)",718,{"$f":"VLOOKUP(A1640,Municipios!$B$2:$B$223,1,FALSE)","v":"Vitoria-Gasteiz"}]
["Segovia","Coruña (A)","Segovia-hasta-Coruña (A)",546,{"$f":"VLOOKUP(A1641,Municipios!$B$2:$B$223,1,FALSE)","v":"Segovia"}]
["Granada","Coruña (A)","Granada-hasta-Coruña (A)",1019,{"$f":"VLOOKUP(A1642,Municipios!$B$2:$B$223,1,FALSE)","v":"Granada"}]
["Zamora","Coruña (A)","Zamora-hasta-Coruña (A)",392,{"$f":"VLOOKUP(A1643,Municipios!$B$2:$B$223,1,FALSE)","v":"Zamora"}]
["Valladolid","Coruña (A)","Valladolid-hasta-Coruña (A)",442,{"$f":"VLOOKUP(A1644,Municipios!$B$2:$B$223,1,FALSE)","v":"Valladolid"}]
["Valencia","Coruña (A)","Valencia-hasta-Coruña (A)",956,{"$f":"VLOOKUP(A1645,Municipios!$B$2:$B$223,1,FALSE)","v":"Valencia"}]
["Toledo","Coruña (A)","Toledo-hasta-Coruña (A)",666,{"$f":"VLOOKUP(A1646,Municipios!$B$2:$B$223,1,FALSE)","v":"Toledo"}]
["Teruel","Coruña (A)","Teruel-hasta-Coruña (A)",924,{"$f":"VLOOKUP(A1647,Municipios!$B$2:$B$223,1,FALSE)","v":"Teruel"}]
["Tarragona","Coruña (A)","Tarragona-hasta-Coruña (A)",1079,{"$f":"VLOOKUP(A1648,Municipios!$B$2:$B$223,1,FALSE)","v":"Tarragona"}]
["Soria","Coruña (A)","Soria-hasta-Coruña (A)",659,{"$f":"VLOOKUP(A1649,Municipios!$B$2:$B$223,1,FALSE)","v":"Soria"}]
["Sevilla","Coruña (A)","Sevilla-hasta-Coruña (A)",930,{"$f":"VLOOKUP(A1650,Municipios!$B$2:$B$223,1,FALSE)","v":"Sevilla"}]
["Zaragoza","Coruña (A)","Zaragoza-hasta-Coruña (A)",812,{"$f":"VLOOKUP(A1651,Municipios!$B$2:$B$223,1,FALSE)","v":"Zaragoza"}]
["Zamora","Cuenca","Zamora-hasta-Cuenca",439,{"$f":"VLOOKUP(A1652,Municipios!$B$2:$B$223,1,FALSE)","v":"Zamora"}]
["Soria","Cuenca","Soria-hasta-Cuenca",269,{"$f":"VLOOKUP(A1653,Municipios!$B$2:$B$223,1,FALSE)","v":"Soria"}]
["Pontevedra","Cuenca","Pontevedra-hasta-Cuenca",774,{"$f":"VLOOKUP(A1654,Municipios!$B$2:$B$223,1,FALSE)","v":"Pontevedra"}]
["Donostia-San Sebastián","Cuenca","Donostia-San Sebastián-hasta-Cuenca",543,{"$f":"VLOOKUP(A1655,Municipios!$B$2:$B$223,1,FALSE)","v":"Donostia-San Sebastián"}]
["Santander","Cuenca","Santander-hasta-Cuenca",564,{"$f":"VLOOKUP(A1656,Municipios!$B$2:$B$223,1,FALSE)","v":"Santander"}]
["Segovia","Cuenca","Segovia-hasta-Cuenca",280,{"$f":"VLOOKUP(A1657,Municipios!$B$2:$B$223,1,FALSE)","v":"Segovia"}]
["Sevilla","Cuenca","Sevilla-hasta-Cuenca",588,{"$f":"VLOOKUP(A1658,Municipios!$B$2:$B$223,1,FALSE)","v":"Sevilla"}]
["Tarragona","Cuenca","Tarragona-hasta-Cuenca",446,{"$f":"VLOOKUP(A1659,Municipios!$B$2:$B$223,1,FALSE)","v":"Tarragona"}]
["Teruel","Cuenca","Teruel-hasta-Cuenca",147,{"$f":"VLOOKUP(A1660,Municipios!$B$2:$B$223,1,FALSE)","v":"Teruel"}]
["Toledo","Cuenca","Toledo-hasta-Cuenca",177,{"$f":"VLOOKUP(A1661,Municipios!$B$2:$B$223,1,FALSE)","v":"Toledo"}]
["Valencia","Cuenca","Valencia-hasta-Cuenca",180,{"$f":"VLOOKUP(A1662,Municipios!$B$2:$B$223,1,FALSE)","v":"Valencia"}]
["Vitoria-Gasteiz","Cuenca",{"$f":"CONCATENATE(A1663,\"-hasta-\",B1663)","v":"Vitoria-Gasteiz-hasta-Cuenca"},467,{"$f":"VLOOKUP(A1663,Municipios!$B$2:$B$223,1,FALSE)","v":"Vitoria-Gasteiz"}]
["Pamplona/Iruña","Cuenca","Pamplona/Iruña-hasta-Cuenca",453,{"$f":"VLOOKUP(A1664,Municipios!$B$2:$B$223,1,FALSE)","v":"Pamplona/Iruña"}]
["Zaragoza","Cuenca","Zaragoza-hasta-Cuenca",328,{"$f":"VLOOKUP(A1665,Municipios!$B$2:$B$223,1,FALSE)","v":"Zaragoza"}]
["Madrid","Cuenca","Madrid-hasta-Cuenca",162,{"$f":"VLOOKUP(A1666,Municipios!$B$2:$B$223,1,FALSE)","v":"Madrid"}]
["Valladolid","Cuenca","Valladolid-hasta-Cuenca",400,{"$f":"VLOOKUP(A1667,Municipios!$B$2:$B$223,1,FALSE)","v":"Valladolid"}]
["Guadalajara","Cuenca","Guadalajara-hasta-Cuenca",142,{"$f":"VLOOKUP(A1668,Municipios!$B$2:$B$223,1,FALSE)","v":"Guadalajara"}]
["Girona","Cuenca","Girona-hasta-Cuenca",627,{"$f":"VLOOKUP(A1669,Municipios!$B$2:$B$223,1,FALSE)","v":"Girona"}]
["Salamanca","Cuenca","Salamanca-hasta-Cuenca",393,{"$f":"VLOOKUP(A1670,Municipios!$B$2:$B$223,1,FALSE)","v":"Salamanca"}]
["Granada","Cuenca","Granada-hasta-Cuenca",477,{"$f":"VLOOKUP(A1671,Municipios!$B$2:$B$223,1,FALSE)","v":"Granada"}]
["Palencia","Cuenca","Palencia-hasta-Cuenca",448,{"$f":"VLOOKUP(A1672,Municipios!$B$2:$B$223,1,FALSE)","v":"Palencia"}]
["Huelva","Cuenca","Huelva-hasta-Cuenca",680,{"$f":"VLOOKUP(A1673,Municipios!$B$2:$B$223,1,FALSE)","v":"Huelva"}]
["Huesca","Cuenca","Huesca-hasta-Cuenca",397,{"$f":"VLOOKUP(A1674,Municipios!$B$2:$B$223,1,FALSE)","v":"Huesca"}]
["Jaén","Cuenca","Jaén-hasta-Cuenca",392,{"$f":"VLOOKUP(A1675,Municipios!$B$2:$B$223,1,FALSE)","v":"Jaén"}]
["León","Cuenca","León-hasta-Cuenca",525,{"$f":"VLOOKUP(A1676,Municipios!$B$2:$B$223,1,FALSE)","v":"León"}]
["Oviedo","Cuenca","Oviedo-hasta-Cuenca",623,{"$f":"VLOOKUP(A1677,Municipios!$B$2:$B$223,1,FALSE)","v":"Oviedo"}]
["Lugo","Cuenca","Lugo-hasta-Cuenca",692,{"$f":"VLOOKUP(A1678,Municipios!$B$2:$B$223,1,FALSE)","v":"Lugo"}]
["Lleida","Cuenca","Lleida-hasta-Cuenca",468,{"$f":"VLOOKUP(A1679,Municipios!$B$2:$B$223,1,FALSE)","v":"Lleida"}]
["Murcia","Cuenca","Murcia-hasta-Cuenca",287,{"$f":"VLOOKUP(A1680,Municipios!$B$2:$B$223,1,FALSE)","v":"Murcia"}]
["Málaga","Cuenca","Málaga-hasta-Cuenca",610,{"$f":"VLOOKUP(A1681,Municipios!$B$2:$B$223,1,FALSE)","v":"Málaga"}]
["Ourense","Cuenca","Ourense-hasta-Cuenca",680,{"$f":"VLOOKUP(A1682,Municipios!$B$2:$B$223,1,FALSE)","v":"Ourense"}]
["Logroño","Cuenca","Logroño-hasta-Cuenca",378,{"$f":"VLOOKUP(A1683,Municipios!$B$2:$B$223,1,FALSE)","v":"Logroño"}]
["Salamanca","Girona","Salamanca-hasta-Girona",924,{"$f":"VLOOKUP(A1684,Municipios!$B$2:$B$223,1,FALSE)","v":"Salamanca"}]
["Donostia-San Sebastián","Girona","Donostia-San Sebastián-hasta-Girona",651,{"$f":"VLOOKUP(A1685,Municipios!$B$2:$B$223,1,FALSE)","v":"Donostia-San Sebastián"}]
["Santander","Girona","Santander-hasta-Girona",847,{"$f":"VLOOKUP(A1686,Municipios!$B$2:$B$223,1,FALSE)","v":"Santander"}]
["Segovia","Girona","Segovia-hasta-Girona",796,{"$f":"VLOOKUP(A1687,Municipios!$B$2:$B$223,1,FALSE)","v":"Segovia"}]
["Sevilla","Girona","Sevilla-hasta-Girona",1119,{"$f":"VLOOKUP(A1688,Municipios!$B$2:$B$223,1,FALSE)","v":"Sevilla"}]
["Soria","Girona","Soria-hasta-Girona",548,{"$f":"VLOOKUP(A1689,Municipios!$B$2:$B$223,1,FALSE)","v":"Soria"}]
["Tarragona","Girona","Tarragona-hasta-Girona",181,{"$f":"VLOOKUP(A1690,Municipios!$B$2:$B$223,1,FALSE)","v":"Tarragona"}]
["Teruel","Girona","Teruel-hasta-Girona",530,{"$f":"VLOOKUP(A1691,Municipios!$B$2:$B$223,1,FALSE)","v":"Teruel"}]
["Toledo","Girona","Toledo-hasta-Girona",769,{"$f":"VLOOKUP(A1692,Municipios!$B$2:$B$223,1,FALSE)","v":"Toledo"}]
["Zamora","Girona","Zamora-hasta-Girona",852,{"$f":"VLOOKUP(A1693,Municipios!$B$2:$B$223,1,FALSE)","v":"Zamora"}]
["Valladolid","Girona","Valladolid-hasta-Girona",803,{"$f":"VLOOKUP(A1694,Municipios!$B$2:$B$223,1,FALSE)","v":"Valladolid"}]
["Vitoria-Gasteiz","Girona","Vitoria-Gasteiz-hasta-Girona",651,{"$f":"VLOOKUP(A1695,Municipios!$B$2:$B$223,1,FALSE)","v":"Vitoria-Gasteiz"}]
["Zaragoza","Girona","Zaragoza-hasta-Girona",390,{"$f":"VLOOKUP(A1696,Municipios!$B$2:$B$223,1,FALSE)","v":"Zaragoza"}]
["Pontevedra","Girona","Pontevedra-hasta-Girona",1125,{"$f":"VLOOKUP(A1697,Municipios!$B$2:$B$223,1,FALSE)","v":"Pontevedra"}]
["Huelva","Girona","Huelva-hasta-Girona",1210,{"$f":"VLOOKUP(A1698,Municipios!$B$2:$B$223,1,FALSE)","v":"Huelva"}]
["Valencia","Girona","Valencia-hasta-Girona",445,{"$f":"VLOOKUP(A1699,Municipios!$B$2:$B$223,1,FALSE)","v":"Valencia"}]
["Logroño","Girona","Logroño-hasta-Girona",561,{"$f":"VLOOKUP(A1700,Municipios!$B$2:$B$223,1,FALSE)","v":"Logroño"}]
["Jaén","Girona","Jaén-hasta-Girona",918,{"$f":"VLOOKUP(A1701,Municipios!$B$2:$B$223,1,FALSE)","v":"Jaén"}]
["Guadalajara","Girona","Guadalajara-hasta-Girona",642,{"$f":"VLOOKUP(A1702,Municipios!$B$2:$B$223,1,FALSE)","v":"Guadalajara"}]
["Pamplona/Iruña","Girona","Pamplona/Iruña-hasta-Girona",561,{"$f":"VLOOKUP(A1703,Municipios!$B$2:$B$223,1,FALSE)","v":"Pamplona/Iruña"}]
["León","Girona","León-hasta-Girona",883,{"$f":"VLOOKUP(A1704,Municipios!$B$2:$B$223,1,FALSE)","v":"León"}]
["Granada","Girona","Granada-hasta-Girona",1016,{"$f":"VLOOKUP(A1705,Municipios!$B$2:$B$223,1,FALSE)","v":"Granada"}]
["Lugo","Girona","Lugo-hasta-Girona",1104,{"$f":"VLOOKUP(A1706,Municipios!$B$2:$B$223,1,FALSE)","v":"Lugo"}]
["Lleida","Girona","Lleida-hasta-Girona",246,{"$f":"VLOOKUP(A1707,Municipios!$B$2:$B$223,1,FALSE)","v":"Lleida"}]
["Madrid","Girona","Madrid-hasta-Girona",693,{"$f":"VLOOKUP(A1708,Municipios!$B$2:$B$223,1,FALSE)","v":"Madrid"}]
["Málaga","Girona","Málaga-hasta-Girona",1141,{"$f":"VLOOKUP(A1709,Municipios!$B$2:$B$223,1,FALSE)","v":"Málaga"}]
["Murcia","Girona","Murcia-hasta-Girona",698,{"$f":"VLOOKUP(A1710,Municipios!$B$2:$B$223,1,FALSE)","v":"Murcia"}]
["Ourense","Girona","Ourense-hasta-Girona",1032,{"$f":"VLOOKUP(A1711,Municipios!$B$2:$B$223,1,FALSE)","v":"Ourense"}]
["Oviedo","Girona","Oviedo-hasta-Girona",1001,{"$f":"VLOOKUP(A1712,Municipios!$B$2:$B$223,1,FALSE)","v":"Oviedo"}]
["Palencia","Girona","Palencia-hasta-Girona",782,{"$f":"VLOOKUP(A1713,Municipios!$B$2:$B$223,1,FALSE)","v":"Palencia"}]
["Huesca","Girona","Huesca-hasta-Girona",465,{"$f":"VLOOKUP(A1714,Municipios!$B$2:$B$223,1,FALSE)","v":"Huesca"}]
["Sevilla","Granada","Sevilla-hasta-Granada",253,{"$f":"VLOOKUP(A1715,Municipios!$B$2:$B$223,1,FALSE)","v":"Sevilla"}]
["Pontevedra","Granada","Pontevedra-hasta-Granada",1027,{"$f":"VLOOKUP(A1716,Municipios!$B$2:$B$223,1,FALSE)","v":"Pontevedra"}]
["Salamanca","Granada","Salamanca-hasta-Granada",634,{"$f":"VLOOKUP(A1717,Municipios!$B$2:$B$223,1,FALSE)","v":"Salamanca"}]
["Donostia-San Sebastián","Granada","Donostia-San Sebastián-hasta-Granada",887,{"$f":"VLOOKUP(A1718,Municipios!$B$2:$B$223,1,FALSE)","v":"Donostia-San Sebastián"}]
["Santander","Granada","Santander-hasta-Granada",822,{"$f":"VLOOKUP(A1719,Municipios!$B$2:$B$223,1,FALSE)","v":"Santander"}]
["Segovia","Granada","Segovia-hasta-Granada",521,{"$f":"VLOOKUP(A1720,Municipios!$B$2:$B$223,1,FALSE)","v":"Segovia"}]
["Soria","Granada","Soria-hasta-Granada",651,{"$f":"VLOOKUP(A1721,Municipios!$B$2:$B$223,1,FALSE)","v":"Soria"}]
["Teruel","Granada","Teruel-hasta-Granada",658,{"$f":"VLOOKUP(A1722,Municipios!$B$2:$B$223,1,FALSE)","v":"Teruel"}]
["Toledo","Granada","Toledo-hasta-Granada",405,{"$f":"VLOOKUP(A1723,Municipios!$B$2:$B$223,1,FALSE)","v":"Toledo"}]
["Valencia","Granada","Valencia-hasta-Granada",661,{"$f":"VLOOKUP(A1724,Municipios!$B$2:$B$223,1,FALSE)","v":"Valencia"}]
["Valladolid","Granada","Valladolid-hasta-Granada",643,{"$f":"VLOOKUP(A1725,Municipios!$B$2:$B$223,1,FALSE)","v":"Valladolid"}]
["Zaragoza","Granada","Zaragoza-hasta-Granada",736,{"$f":"VLOOKUP(A1726,Municipios!$B$2:$B$223,1,FALSE)","v":"Zaragoza"}]
["Oviedo","Granada",{"$f":"CONCATENATE(A1727,\"-hasta-\",B1727)","v":"Oviedo-hasta-Granada"},864,{"$f":"VLOOKUP(A1727,Municipios!$B$2:$B$223,1,FALSE)","v":"Oviedo"}]
["Tarragona","Granada","Tarragona-hasta-Granada",913,{"$f":"VLOOKUP(A1728,Municipios!$B$2:$B$223,1,FALSE)","v":"Tarragona"}]
["Zamora","Granada","Zamora-hasta-Granada",680,{"$f":"VLOOKUP(A1729,Municipios!$B$2:$B$223,1,FALSE)","v":"Zamora"}]
["Jaén","Granada","Jaén-hasta-Granada",91,{"$f":"VLOOKUP(A1730,Municipios!$B$2:$B$223,1,FALSE)","v":"Jaén"}]
["Pamplona/Iruña","Granada","Pamplona/Iruña-hasta-Granada",842,{"$f":"VLOOKUP(A1731,Municipios!$B$2:$B$223,1,FALSE)","v":"Pamplona/Iruña"}]
["Palencia","Granada","Palencia-hasta-Granada",691,{"$f":"VLOOKUP(A1732,Municipios!$B$2:$B$223,1,FALSE)","v":"Palencia"}]
["Guadalajara","Granada","Guadalajara-hasta-Granada",477,{"$f":"VLOOKUP(A1733,Municipios!$B$2:$B$223,1,FALSE)","v":"Guadalajara"}]
["Huesca","Granada","Huesca-hasta-Granada",807,{"$f":"VLOOKUP(A1734,Municipios!$B$2:$B$223,1,FALSE)","v":"Huesca"}]
["Vitoria-Gasteiz","Granada","Vitoria-Gasteiz-hasta-Granada",770,{"$f":"VLOOKUP(A1735,Municipios!$B$2:$B$223,1,FALSE)","v":"Vitoria-Gasteiz"}]
["León","Granada","León-hasta-Granada",766,{"$f":"VLOOKUP(A1736,Municipios!$B$2:$B$223,1,FALSE)","v":"León"}]
["Logroño","Granada","Logroño-hasta-Granada",805,{"$f":"VLOOKUP(A1737,Municipios!$B$2:$B$223,1,FALSE)","v":"Logroño"}]
["Lugo","Granada","Lugo-hasta-Granada",934,{"$f":"VLOOKUP(A1738,Municipios!$B$2:$B$223,1,FALSE)","v":"Lugo"}]
["Lleida","Granada","Lleida-hasta-Granada",876,{"$f":"VLOOKUP(A1739,Municipios!$B$2:$B$223,1,FALSE)","v":"Lleida"}]
["Madrid","Granada","Madrid-hasta-Granada",418,{"$f":"VLOOKUP(A1740,Municipios!$B$2:$B$223,1,FALSE)","v":"Madrid"}]
["Málaga","Granada","Málaga-hasta-Granada",140,{"$f":"VLOOKUP(A1741,Municipios!$B$2:$B$223,1,FALSE)","v":"Málaga"}]
["Murcia","Granada","Murcia-hasta-Granada",338,{"$f":"VLOOKUP(A1742,Municipios!$B$2:$B$223,1,FALSE)","v":"Murcia"}]
["Ourense","Granada","Ourense-hasta-Granada",922,{"$f":"VLOOKUP(A1743,Municipios!$B$2:$B$223,1,FALSE)","v":"Ourense"}]
["Huelva","Granada","Huelva-hasta-Granada",339,{"$f":"VLOOKUP(A1744,Municipios!$B$2:$B$223,1,FALSE)","v":"Huelva"}]
["Tarragona","Guadalajara","Tarragona-hasta-Guadalajara",525,{"$f":"VLOOKUP(A1745,Municipios!$B$2:$B$223,1,FALSE)","v":"Tarragona"}]
["León","Guadalajara","León-hasta-Guadalajara",399,{"$f":"VLOOKUP(A1746,Municipios!$B$2:$B$223,1,FALSE)","v":"León"}]
["Santander","Guadalajara","Santander-hasta-Guadalajara",410,{"$f":"VLOOKUP(A1747,Municipios!$B$2:$B$223,1,FALSE)","v":"Santander"}]
["Segovia","Guadalajara","Segovia-hasta-Guadalajara",148,{"$f":"VLOOKUP(A1748,Municipios!$B$2:$B$223,1,FALSE)","v":"Segovia"}]
["Sevilla","Guadalajara","Sevilla-hasta-Guadalajara",586,{"$f":"VLOOKUP(A1749,Municipios!$B$2:$B$223,1,FALSE)","v":"Sevilla"}]
["Soria","Guadalajara","Soria-hasta-Guadalajara",169,{"$f":"VLOOKUP(A1750,Municipios!$B$2:$B$223,1,FALSE)","v":"Soria"}]
["Teruel","Guadalajara","Teruel-hasta-Guadalajara",251,{"$f":"VLOOKUP(A1751,Municipios!$B$2:$B$223,1,FALSE)","v":"Teruel"}]
["Toledo","Guadalajara","Toledo-hasta-Guadalajara",127,{"$f":"VLOOKUP(A1752,Municipios!$B$2:$B$223,1,FALSE)","v":"Toledo"}]
["Valencia","Guadalajara","Valencia-hasta-Guadalajara",306,{"$f":"VLOOKUP(A1753,Municipios!$B$2:$B$223,1,FALSE)","v":"Valencia"}]
["Valladolid","Guadalajara","Valladolid-hasta-Guadalajara",254,{"$f":"VLOOKUP(A1754,Municipios!$B$2:$B$223,1,FALSE)","v":"Valladolid"}]
["Vitoria-Gasteiz","Guadalajara","Vitoria-Gasteiz-hasta-Guadalajara",346,{"$f":"VLOOKUP(A1755,Municipios!$B$2:$B$223,1,FALSE)","v":"Vitoria-Gasteiz"}]
["Zamora","Guadalajara","Zamora-hasta-Guadalajara",313,{"$f":"VLOOKUP(A1756,Municipios!$B$2:$B$223,1,FALSE)","v":"Zamora"}]
["Pontevedra","Guadalajara","Pontevedra-hasta-Guadalajara",659,{"$f":"VLOOKUP(A1757,Municipios!$B$2:$B$223,1,FALSE)","v":"Pontevedra"}]
["Zaragoza","Guadalajara","Zaragoza-hasta-Guadalajara",260,{"$f":"VLOOKUP(A1758,Municipios!$B$2:$B$223,1,FALSE)","v":"Zaragoza"}]
["Huesca","Guadalajara","Huesca-hasta-Guadalajara",331,{"$f":"VLOOKUP(A1759,Municipios!$B$2:$B$223,1,FALSE)","v":"Huesca"}]
["Huelva","Guadalajara","Huelva-hasta-Guadalajara",677,{"$f":"VLOOKUP(A1760,Municipios!$B$2:$B$223,1,FALSE)","v":"Huelva"}]
["Salamanca","Guadalajara","Salamanca-hasta-Guadalajara",267,{"$f":"VLOOKUP(A1761,Municipios!$B$2:$B$223,1,FALSE)","v":"Salamanca"}]
["Jaén","Guadalajara","Jaén-hasta-Guadalajara",385,{"$f":"VLOOKUP(A1762,Municipios!$B$2:$B$223,1,FALSE)","v":"Jaén"}]
["Logroño","Guadalajara","Logroño-hasta-Guadalajara",274,{"$f":"VLOOKUP(A1763,Municipios!$B$2:$B$223,1,FALSE)","v":"Logroño"}]
["Lugo","Guadalajara","Lugo-hasta-Guadalajara",566,{"$f":"VLOOKUP(A1764,Municipios!$B$2:$B$223,1,FALSE)","v":"Lugo"}]
["Lleida","Guadalajara","Lleida-hasta-Guadalajara",421,{"$f":"VLOOKUP(A1765,Municipios!$B$2:$B$223,1,FALSE)","v":"Lleida"}]
["Málaga","Guadalajara","Málaga-hasta-Guadalajara",607,{"$f":"VLOOKUP(A1766,Municipios!$B$2:$B$223,1,FALSE)","v":"Málaga"}]
["Murcia","Guadalajara","Murcia-hasta-Guadalajara",439,{"$f":"VLOOKUP(A1767,Municipios!$B$2:$B$223,1,FALSE)","v":"Murcia"}]
["Ourense","Guadalajara","Ourense-hasta-Guadalajara",554,{"$f":"VLOOKUP(A1768,Municipios!$B$2:$B$223,1,FALSE)","v":"Ourense"}]
["Oviedo","Guadalajara","Oviedo-hasta-Guadalajara",497,{"$f":"VLOOKUP(A1769,Municipios!$B$2:$B$223,1,FALSE)","v":"Oviedo"}]
["Palencia","Guadalajara","Palencia-hasta-Guadalajara",322,{"$f":"VLOOKUP(A1770,Municipios!$B$2:$B$223,1,FALSE)","v":"Palencia"}]
["Pamplona/Iruña","Guadalajara","Pamplona/Iruña-hasta-Guadalajara",436,{"$f":"VLOOKUP(A1771,Municipios!$B$2:$B$223,1,FALSE)","v":"Pamplona/Iruña"}]
["Madrid","Guadalajara","Madrid-hasta-Guadalajara",51,{"$f":"VLOOKUP(A1772,Municipios!$B$2:$B$223,1,FALSE)","v":"Madrid"}]
["Donostia-San Sebastián","Guadalajara","Donostia-San Sebastián-hasta-Guadalajara",463,{"$f":"VLOOKUP(A1773,Municipios!$B$2:$B$223,1,FALSE)","v":"Donostia-San Sebastián"}]
["Zaragoza","Huelva","Zaragoza-hasta-Huelva",937,{"$f":"VLOOKUP(A1774,Municipios!$B$2:$B$223,1,FALSE)","v":"Zaragoza"}]
["Santander","Huelva","Santander-hasta-Huelva",919,{"$f":"VLOOKUP(A1775,Municipios!$B$2:$B$223,1,FALSE)","v":"Santander"}]
["Segovia","Huelva","Segovia-hasta-Huelva",647,{"$f":"VLOOKUP(A1776,Municipios!$B$2:$B$223,1,FALSE)","v":"Segovia"}]
["Soria","Huelva","Soria-hasta-Huelva",846,{"$f":"VLOOKUP(A1777,Municipios!$B$2:$B$223,1,FALSE)","v":"Soria"}]
["Teruel","Huelva","Teruel-hasta-Huelva",842,{"$f":"VLOOKUP(A1778,Municipios!$B$2:$B$223,1,FALSE)","v":"Teruel"}]
["Toledo","Huelva","Toledo-hasta-Huelva",611,{"$f":"VLOOKUP(A1779,Municipios!$B$2:$B$223,1,FALSE)","v":"Toledo"}]
["Valencia","Huelva","Valencia-hasta-Huelva",777,{"$f":"VLOOKUP(A1780,Municipios!$B$2:$B$223,1,FALSE)","v":"Valencia"}]
["Valladolid","Huelva","Valladolid-hasta-Huelva",679,{"$f":"VLOOKUP(A1781,Municipios!$B$2:$B$223,1,FALSE)","v":"Valladolid"}]
["Zamora","Huelva","Zamora-hasta-Huelva",624,{"$f":"VLOOKUP(A1782,Municipios!$B$2:$B$223,1,FALSE)","v":"Zamora"}]
["Donostia-San Sebastián","Huelva","Donostia-San Sebastián-hasta-Huelva",1087,{"$f":"VLOOKUP(A1783,Municipios!$B$2:$B$223,1,FALSE)","v":"Donostia-San Sebastián"}]
["Sevilla","Huelva","Sevilla-hasta-Huelva",85,{"$f":"VLOOKUP(A1784,Municipios!$B$2:$B$223,1,FALSE)","v":"Sevilla"}]
["Vitoria-Gasteiz","Huelva","Vitoria-Gasteiz-hasta-Huelva",970,{"$f":"VLOOKUP(A1785,Municipios!$B$2:$B$223,1,FALSE)","v":"Vitoria-Gasteiz"}]
["Lugo","Huelva","Lugo-hasta-Huelva",924,{"$f":"VLOOKUP(A1786,Municipios!$B$2:$B$223,1,FALSE)","v":"Lugo"}]
["Tarragona","Huelva","Tarragona-hasta-Huelva",1032,{"$f":"VLOOKUP(A1787,Municipios!$B$2:$B$223,1,FALSE)","v":"Tarragona"}]
["Salamanca","Huelva","Salamanca-hasta-Huelva",558,{"$f":"VLOOKUP(A1788,Municipios!$B$2:$B$223,1,FALSE)","v":"Salamanca"}]
["Jaén","Huelva","Jaén-hasta-Huelva",369,{"$f":"VLOOKUP(A1789,Municipios!$B$2:$B$223,1,FALSE)","v":"Jaén"}]
["León","Huelva","León-hasta-Huelva",759,{"$f":"VLOOKUP(A1790,Municipios!$B$2:$B$223,1,FALSE)","v":"León"}]
["Logroño","Huelva",{"$f":"CONCATENATE(A1791,\"-hasta-\",B1791)","v":"Logroño-hasta-Huelva"},1005,{"$f":"VLOOKUP(A1791,Municipios!$B$2:$B$223,1,FALSE)","v":"Logroño"}]
["Lleida","Huelva","Lleida-hasta-Huelva",1098,{"$f":"VLOOKUP(A1792,Municipios!$B$2:$B$223,1,FALSE)","v":"Lleida"}]
["Madrid","Huelva","Madrid-hasta-Huelva",620,{"$f":"VLOOKUP(A1793,Municipios!$B$2:$B$223,1,FALSE)","v":"Madrid"}]
["Málaga","Huelva","Málaga-hasta-Huelva",285,{"$f":"VLOOKUP(A1794,Municipios!$B$2:$B$223,1,FALSE)","v":"Málaga"}]
["Palencia","Huelva","Palencia-hasta-Huelva",788,{"$f":"VLOOKUP(A1795,Municipios!$B$2:$B$223,1,FALSE)","v":"Palencia"}]
["Pontevedra","Huelva","Pontevedra-hasta-Huelva",1004,{"$f":"VLOOKUP(A1796,Municipios!$B$2:$B$223,1,FALSE)","v":"Pontevedra"}]
["Huesca","Huelva","Huesca-hasta-Huelva",1008,{"$f":"VLOOKUP(A1797,Municipios!$B$2:$B$223,1,FALSE)","v":"Huesca"}]
["Pamplona/Iruña","Huelva","Pamplona/Iruña-hasta-Huelva",1060,{"$f":"VLOOKUP(A1798,Municipios!$B$2:$B$223,1,FALSE)","v":"Pamplona/Iruña"}]
["Murcia","Huelva","Murcia-hasta-Huelva",686,{"$f":"VLOOKUP(A1799,Municipios!$B$2:$B$223,1,FALSE)","v":"Murcia"}]
["Oviedo","Huelva","Oviedo-hasta-Huelva",878,{"$f":"VLOOKUP(A1800,Municipios!$B$2:$B$223,1,FALSE)","v":"Oviedo"}]
["Ourense","Huelva","Ourense-hasta-Huelva",916,{"$f":"VLOOKUP(A1801,Municipios!$B$2:$B$223,1,FALSE)","v":"Ourense"}]
["Teruel","Alicante/Alacant","Teruel-hasta-Alicante/Alacant",328,{"$f":"VLOOKUP(A1802,Municipios!$B$2:$B$223,1,FALSE)","v":"Teruel"}]
["Pamplona/Iruña","Alicante/Alacant","Pamplona/Iruña-hasta-Alicante/Alacant",705,{"$f":"VLOOKUP(A1803,Municipios!$B$2:$B$223,1,FALSE)","v":"Pamplona/Iruña"}]
["Barcelona","Alicante/Alacant","Barcelona-hasta-Alicante/Alacant",546,{"$f":"VLOOKUP(A1804,Municipios!$B$2:$B$223,1,FALSE)","v":"Barcelona"}]
["Pontevedra","Alicante/Alacant","Pontevedra-hasta-Alicante/Alacant",1031,{"$f":"VLOOKUP(A1805,Municipios!$B$2:$B$223,1,FALSE)","v":"Pontevedra"}]
["Segovia","Alicante/Alacant","Segovia-hasta-Alicante/Alacant",535,{"$f":"VLOOKUP(A1806,Municipios!$B$2:$B$223,1,FALSE)","v":"Segovia"}]
["Sevilla","Alicante/Alacant","Sevilla-hasta-Alicante/Alacant",656,{"$f":"VLOOKUP(A1807,Municipios!$B$2:$B$223,1,FALSE)","v":"Sevilla"}]
["Soria","Alicante/Alacant","Soria-hasta-Alicante/Alacant",577,{"$f":"VLOOKUP(A1808,Municipios!$B$2:$B$223,1,FALSE)","v":"Soria"}]
["Ávila","Alicante/Alacant","Ávila-hasta-Alicante/Alacant",555,{"$f":"VLOOKUP(A1809,Municipios!$B$2:$B$223,1,FALSE)","v":"Ávila"}]
["Tarragona","Alicante/Alacant","Tarragona-hasta-Alicante/Alacant",448,{"$f":"VLOOKUP(A1810,Municipios!$B$2:$B$223,1,FALSE)","v":"Tarragona"}]
["Donostia-San Sebastián","Alicante/Alacant","Donostia-San Sebastián-hasta-Alicante/Alacant",795,{"$f":"VLOOKUP(A1811,Municipios!$B$2:$B$223,1,FALSE)","v":"Donostia-San Sebastián"}]
["Toledo","Alicante/Alacant","Toledo-hasta-Alicante/Alacant",454,{"$f":"VLOOKUP(A1812,Municipios!$B$2:$B$223,1,FALSE)","v":"Toledo"}]
["Valencia","Alicante/Alacant","Valencia-hasta-Alicante/Alacant",195,{"$f":"VLOOKUP(A1813,Municipios!$B$2:$B$223,1,FALSE)","v":"Valencia"}]
["Valladolid","Alicante/Alacant","Valladolid-hasta-Alicante/Alacant",647,{"$f":"VLOOKUP(A1814,Municipios!$B$2:$B$223,1,FALSE)","v":"Valladolid"}]
["Vitoria-Gasteiz","Alicante/Alacant","Vitoria-Gasteiz-hasta-Alicante/Alacant",761,{"$f":"VLOOKUP(A1815,Municipios!$B$2:$B$223,1,FALSE)","v":"Vitoria-Gasteiz"}]
["Zamora","Alicante/Alacant","Zamora-hasta-Alicante/Alacant",694,{"$f":"VLOOKUP(A1816,Municipios!$B$2:$B$223,1,FALSE)","v":"Zamora"}]
["Badajoz","Alicante/Alacant","Badajoz-hasta-Alicante/Alacant",684,{"$f":"VLOOKUP(A1817,Municipios!$B$2:$B$223,1,FALSE)","v":"Badajoz"}]
["Bilbao","Alicante/Alacant","Bilbao-hasta-Alicante/Alacant",797,{"$f":"VLOOKUP(A1818,Municipios!$B$2:$B$223,1,FALSE)","v":"Bilbao"}]
["Burgos","Alicante/Alacant","Burgos-hasta-Alicante/Alacant",653,{"$f":"VLOOKUP(A1819,Municipios!$B$2:$B$223,1,FALSE)","v":"Burgos"}]
["Cáceres","Alicante/Alacant","Cáceres-hasta-Alicante/Alacant",678,{"$f":"VLOOKUP(A1820,Municipios!$B$2:$B$223,1,FALSE)","v":"Cáceres"}]
["Palencia","Alicante/Alacant","Palencia-hasta-Alicante/Alacant",695,{"$f":"VLOOKUP(A1821,Municipios!$B$2:$B$223,1,FALSE)","v":"Palencia"}]
["Salamanca","Alicante/Alacant","Salamanca-hasta-Alicante/Alacant",648,{"$f":"VLOOKUP(A1822,Municipios!$B$2:$B$223,1,FALSE)","v":"Salamanca"}]
["Zaragoza","Alicante/Alacant","Zaragoza-hasta-Alicante/Alacant",530,{"$f":"VLOOKUP(A1823,Municipios!$B$2:$B$223,1,FALSE)","v":"Zaragoza"}]
["Coruña (A)","Alicante/Alacant","Coruña (A)-hasta-Alicante/Alacant",1026,{"$f":"VLOOKUP(A1824,Municipios!$B$2:$B$223,1,FALSE)","v":"Coruña (A)"}]
["Santander","Alicante/Alacant","Santander-hasta-Alicante/Alacant",819,{"$f":"VLOOKUP(A1825,Municipios!$B$2:$B$223,1,FALSE)","v":"Santander"}]
["Cádiz","Alicante/Alacant","Cádiz-hasta-Alicante/Alacant",760,{"$f":"VLOOKUP(A1826,Municipios!$B$2:$B$223,1,FALSE)","v":"Cádiz"}]
["Castellón de la Plana/Castelló de la Plana","Alicante/Alacant","Castellón de la Plana/Castelló de la Plana-hasta-Alicante/Alacant",262,{"$f":"VLOOKUP(A1827,Municipios!$B$2:$B$223,1,FALSE)","v":"Castellón de la Plana/Castelló de la Plana"}]
["Oviedo","Alicante/Alacant","Oviedo-hasta-Alicante/Alacant",878,{"$f":"VLOOKUP(A1828,Municipios!$B$2:$B$223,1,FALSE)","v":"Oviedo"}]
["Córdoba","Alicante/Alacant","Córdoba-hasta-Alicante/Alacant",519,{"$f":"VLOOKUP(A1829,Municipios!$B$2:$B$223,1,FALSE)","v":"Córdoba"}]
["Cuenca","Alicante/Alacant","Cuenca-hasta-Alicante/Alacant",307,{"$f":"VLOOKUP(A1830,Municipios!$B$2:$B$223,1,FALSE)","v":"Cuenca"}]
["Girona","Alicante/Alacant","Girona-hasta-Alicante/Alacant",629,{"$f":"VLOOKUP(A1831,Municipios!$B$2:$B$223,1,FALSE)","v":"Girona"}]
["Granada","Alicante/Alacant","Granada-hasta-Alicante/Alacant",472,{"$f":"VLOOKUP(A1832,Municipios!$B$2:$B$223,1,FALSE)","v":"Granada"}]
["Guadalajara","Alicante/Alacant","Guadalajara-hasta-Alicante/Alacant",469,{"$f":"VLOOKUP(A1833,Municipios!$B$2:$B$223,1,FALSE)","v":"Guadalajara"}]
["Huelva","Alicante/Alacant","Huelva-hasta-Alicante/Alacant",474,{"$f":"VLOOKUP(A1834,Municipios!$B$2:$B$223,1,FALSE)","v":"Huelva"}]
["Málaga","Alicante/Alacant","Málaga-hasta-Alicante/Alacant",499,{"$f":"VLOOKUP(A1835,Municipios!$B$2:$B$223,1,FALSE)","v":"Málaga"}]
["Ciudad Real","Alicante/Alacant","Ciudad Real-hasta-Alicante/Alacant",373,{"$f":"VLOOKUP(A1836,Municipios!$B$2:$B$223,1,FALSE)","v":"Ciudad Real"}]
["Huesca","Alicante/Alacant","Huesca-hasta-Alicante/Alacant",603,{"$f":"VLOOKUP(A1837,Municipios!$B$2:$B$223,1,FALSE)","v":"Huesca"}]
["Murcia","Alicante/Alacant","Murcia-hasta-Alicante/Alacant",69,{"$f":"VLOOKUP(A1838,Municipios!$B$2:$B$223,1,FALSE)","v":"Murcia"}]
["Ourense","Alicante/Alacant","Ourense-hasta-Alicante/Alacant",926,{"$f":"VLOOKUP(A1839,Municipios!$B$2:$B$223,1,FALSE)","v":"Ourense"}]
["Madrid","Alicante/Alacant","Madrid-hasta-Alicante/Alacant",417,{"$f":"VLOOKUP(A1840,Municipios!$B$2:$B$223,1,FALSE)","v":"Madrid"}]
["Lleida","Alicante/Alacant","Lleida-hasta-Alicante/Alacant",576,{"$f":"VLOOKUP(A1841,Municipios!$B$2:$B$223,1,FALSE)","v":"Lleida"}]
["Lugo","Alicante/Alacant","Lugo-hasta-Alicante/Alacant",938,{"$f":"VLOOKUP(A1842,Municipios!$B$2:$B$223,1,FALSE)","v":"Lugo"}]
["Logroño","Alicante/Alacant","Logroño-hasta-Alicante/Alacant",698,{"$f":"VLOOKUP(A1843,Municipios!$B$2:$B$223,1,FALSE)","v":"Logroño"}]
["León","Alicante/Alacant","León-hasta-Alicante/Alacant",780,{"$f":"VLOOKUP(A1844,Municipios!$B$2:$B$223,1,FALSE)","v":"León"}]
["Jaén","Alicante/Alacant","Jaén-hasta-Alicante/Alacant",455,{"$f":"VLOOKUP(A1845,Municipios!$B$2:$B$223,1,FALSE)","v":"Jaén"}]
["Almería","Alicante/Alacant","Almería-hasta-Alicante/Alacant",281,{"$f":"VLOOKUP(A1846,Municipios!$B$2:$B$223,1,FALSE)","v":"Almería"}]
["Donostia-San Sebastián","Huesca","Donostia-San Sebastián-hasta-Huesca",269,{"$f":"VLOOKUP(A1847,Municipios!$B$2:$B$223,1,FALSE)","v":"Donostia-San Sebastián"}]
["Teruel","Huesca","Teruel-hasta-Huesca",256,{"$f":"VLOOKUP(A1848,Municipios!$B$2:$B$223,1,FALSE)","v":"Teruel"}]
["Segovia","Huesca","Segovia-hasta-Huesca",421,{"$f":"VLOOKUP(A1849,Municipios!$B$2:$B$223,1,FALSE)","v":"Segovia"}]
["Sevilla","Huesca","Sevilla-hasta-Huesca",917,{"$f":"VLOOKUP(A1850,Municipios!$B$2:$B$223,1,FALSE)","v":"Sevilla"}]
["Soria","Huesca","Soria-hasta-Huesca",230,{"$f":"VLOOKUP(A1851,Municipios!$B$2:$B$223,1,FALSE)","v":"Soria"}]
["Tarragona","Huesca","Tarragona-hasta-Huesca",216,{"$f":"VLOOKUP(A1852,Municipios!$B$2:$B$223,1,FALSE)","v":"Tarragona"}]
["Toledo","Huesca","Toledo-hasta-Huesca",458,{"$f":"VLOOKUP(A1853,Municipios!$B$2:$B$223,1,FALSE)","v":"Toledo"}]
["Valencia","Huesca","Valencia-hasta-Huesca",453,{"$f":"VLOOKUP(A1854,Municipios!$B$2:$B$223,1,FALSE)","v":"Valencia"}]
["Valladolid","Huesca",{"$f":"CONCATENATE(A1855,\"-hasta-\",B1855)","v":"Valladolid-hasta-Huesca"},510,{"$f":"VLOOKUP(A1855,Municipios!$B$2:$B$223,1,FALSE)","v":"Valladolid"}]
["Zamora","Huesca","Zamora-hasta-Huesca",532,{"$f":"VLOOKUP(A1856,Municipios!$B$2:$B$223,1,FALSE)","v":"Zamora"}]
["Zaragoza","Huesca","Zaragoza-hasta-Huesca",70,{"$f":"VLOOKUP(A1857,Municipios!$B$2:$B$223,1,FALSE)","v":"Zaragoza"}]
["Málaga","Huesca","Málaga-hasta-Huesca",938,{"$f":"VLOOKUP(A1858,Municipios!$B$2:$B$223,1,FALSE)","v":"Málaga"}]
["Salamanca","Huesca","Salamanca-hasta-Huesca",630,{"$f":"VLOOKUP(A1859,Municipios!$B$2:$B$223,1,FALSE)","v":"Salamanca"}]
["Vitoria-Gasteiz","Huesca","Vitoria-Gasteiz-hasta-Huesca",269,{"$f":"VLOOKUP(A1860,Municipios!$B$2:$B$223,1,FALSE)","v":"Vitoria-Gasteiz"}]
["Lleida","Huesca","Lleida-hasta-Huesca",119,{"$f":"VLOOKUP(A1861,Municipios!$B$2:$B$223,1,FALSE)","v":"Lleida"}]
["Santander","Huesca","Santander-hasta-Huesca",539,{"$f":"VLOOKUP(A1862,Municipios!$B$2:$B$223,1,FALSE)","v":"Santander"}]
["León","Huesca","León-hasta-Huesca",575,{"$f":"VLOOKUP(A1863,Municipios!$B$2:$B$223,1,FALSE)","v":"León"}]
["Pontevedra","Huesca","Pontevedra-hasta-Huesca",818,{"$f":"VLOOKUP(A1864,Municipios!$B$2:$B$223,1,FALSE)","v":"Pontevedra"}]
["Lugo","Huesca","Lugo-hasta-Huesca",796,{"$f":"VLOOKUP(A1865,Municipios!$B$2:$B$223,1,FALSE)","v":"Lugo"}]
["Jaén","Huesca","Jaén-hasta-Huesca",715,{"$f":"VLOOKUP(A1866,Municipios!$B$2:$B$223,1,FALSE)","v":"Jaén"}]
["Madrid","Huesca","Madrid-hasta-Huesca",382,{"$f":"VLOOKUP(A1867,Municipios!$B$2:$B$223,1,FALSE)","v":"Madrid"}]
["Murcia","Huesca","Murcia-hasta-Huesca",622,{"$f":"VLOOKUP(A1868,Municipios!$B$2:$B$223,1,FALSE)","v":"Murcia"}]
["Ourense","Huesca","Ourense-hasta-Huesca",724,{"$f":"VLOOKUP(A1869,Municipios!$B$2:$B$223,1,FALSE)","v":"Ourense"}]
["Oviedo","Huesca","Oviedo-hasta-Huesca",693,{"$f":"VLOOKUP(A1870,Municipios!$B$2:$B$223,1,FALSE)","v":"Oviedo"}]
["Palencia","Huesca","Palencia-hasta-Huesca",489,{"$f":"VLOOKUP(A1871,Municipios!$B$2:$B$223,1,FALSE)","v":"Palencia"}]
["Pamplona/Iruña","Huesca","Pamplona/Iruña-hasta-Huesca",179,{"$f":"VLOOKUP(A1872,Municipios!$B$2:$B$223,1,FALSE)","v":"Pamplona/Iruña"}]
["Logroño","Huesca","Logroño-hasta-Huesca",241,{"$f":"VLOOKUP(A1873,Municipios!$B$2:$B$223,1,FALSE)","v":"Logroño"}]
["Segovia","Jaén","Segovia-hasta-Jaén",430,{"$f":"VLOOKUP(A1874,Municipios!$B$2:$B$223,1,FALSE)","v":"Segovia"}]
["Sevilla","Jaén","Sevilla-hasta-Jaén",272,{"$f":"VLOOKUP(A1875,Municipios!$B$2:$B$223,1,FALSE)","v":"Sevilla"}]
["Soria","Jaén","Soria-hasta-Jaén",554,{"$f":"VLOOKUP(A1876,Municipios!$B$2:$B$223,1,FALSE)","v":"Soria"}]
["Tarragona","Jaén","Tarragona-hasta-Jaén",739,{"$f":"VLOOKUP(A1877,Municipios!$B$2:$B$223,1,FALSE)","v":"Tarragona"}]
["Teruel","Jaén","Teruel-hasta-Jaén",543,{"$f":"VLOOKUP(A1878,Municipios!$B$2:$B$223,1,FALSE)","v":"Teruel"}]
["Toledo","Jaén","Toledo-hasta-Jaén",316,{"$f":"VLOOKUP(A1879,Municipios!$B$2:$B$223,1,FALSE)","v":"Toledo"}]
["Valencia","Jaén","Valencia-hasta-Jaén",484,{"$f":"VLOOKUP(A1880,Municipios!$B$2:$B$223,1,FALSE)","v":"Valencia"}]
["Valladolid","Jaén","Valladolid-hasta-Jaén",550,{"$f":"VLOOKUP(A1881,Municipios!$B$2:$B$223,1,FALSE)","v":"Valladolid"}]
["Santander","Jaén","Santander-hasta-Jaén",721,{"$f":"VLOOKUP(A1882,Municipios!$B$2:$B$223,1,FALSE)","v":"Santander"}]
["Zamora","Jaén","Zamora-hasta-Jaén",589,{"$f":"VLOOKUP(A1883,Municipios!$B$2:$B$223,1,FALSE)","v":"Zamora"}]
["Málaga","Jaén","Málaga-hasta-Jaén",231,{"$f":"VLOOKUP(A1884,Municipios!$B$2:$B$223,1,FALSE)","v":"Málaga"}]
["Vitoria-Gasteiz","Jaén","Vitoria-Gasteiz-hasta-Jaén",678,{"$f":"VLOOKUP(A1885,Municipios!$B$2:$B$223,1,FALSE)","v":"Vitoria-Gasteiz"}]
["Donostia-San Sebastián","Jaén","Donostia-San Sebastián-hasta-Jaén",795,{"$f":"VLOOKUP(A1886,Municipios!$B$2:$B$223,1,FALSE)","v":"Donostia-San Sebastián"}]
["Salamanca","Jaén","Salamanca-hasta-Jaén",543,{"$f":"VLOOKUP(A1887,Municipios!$B$2:$B$223,1,FALSE)","v":"Salamanca"}]
["Pontevedra","Jaén","Pontevedra-hasta-Jaén",936,{"$f":"VLOOKUP(A1888,Municipios!$B$2:$B$223,1,FALSE)","v":"Pontevedra"}]
["Pamplona/Iruña","Jaén","Pamplona/Iruña-hasta-Jaén",751,{"$f":"VLOOKUP(A1889,Municipios!$B$2:$B$223,1,FALSE)","v":"Pamplona/Iruña"}]
["Palencia","Jaén","Palencia-hasta-Jaén",600,{"$f":"VLOOKUP(A1890,Municipios!$B$2:$B$223,1,FALSE)","v":"Palencia"}]
["Ourense","Jaén","Ourense-hasta-Jaén",831,{"$f":"VLOOKUP(A1891,Municipios!$B$2:$B$223,1,FALSE)","v":"Ourense"}]
["Madrid","Jaén","Madrid-hasta-Jaén",327,{"$f":"VLOOKUP(A1892,Municipios!$B$2:$B$223,1,FALSE)","v":"Madrid"}]
["Lleida","Jaén","Lleida-hasta-Jaén",806,{"$f":"VLOOKUP(A1893,Municipios!$B$2:$B$223,1,FALSE)","v":"Lleida"}]
["Lugo","Jaén","Lugo-hasta-Jaén",843,{"$f":"VLOOKUP(A1894,Municipios!$B$2:$B$223,1,FALSE)","v":"Lugo"}]
["Logroño","Jaén","Logroño-hasta-Jaén",712,{"$f":"VLOOKUP(A1895,Municipios!$B$2:$B$223,1,FALSE)","v":"Logroño"}]
["León","Jaén","León-hasta-Jaén",675,{"$f":"VLOOKUP(A1896,Municipios!$B$2:$B$223,1,FALSE)","v":"León"}]
["Zaragoza","Jaén","Zaragoza-hasta-Jaén",645,{"$f":"VLOOKUP(A1897,Municipios!$B$2:$B$223,1,FALSE)","v":"Zaragoza"}]
["Oviedo","Jaén","Oviedo-hasta-Jaén",773,{"$f":"VLOOKUP(A1898,Municipios!$B$2:$B$223,1,FALSE)","v":"Oviedo"}]
["Murcia","Jaén","Murcia-hasta-Jaén",429,{"$f":"VLOOKUP(A1899,Municipios!$B$2:$B$223,1,FALSE)","v":"Murcia"}]
["Salamanca","León","Salamanca-hasta-León",202,{"$f":"VLOOKUP(A1900,Municipios!$B$2:$B$223,1,FALSE)","v":"Salamanca"}]
["Zamora","León","Zamora-hasta-León",139,{"$f":"VLOOKUP(A1901,Municipios!$B$2:$B$223,1,FALSE)","v":"Zamora"}]
["Vitoria-Gasteiz","León","Vitoria-Gasteiz-hasta-León",296,{"$f":"VLOOKUP(A1902,Municipios!$B$2:$B$223,1,FALSE)","v":"Vitoria-Gasteiz"}]
["Valladolid","León","Valladolid-hasta-León",136,{"$f":"VLOOKUP(A1903,Municipios!$B$2:$B$223,1,FALSE)","v":"Valladolid"}]
["Valencia","León","Valencia-hasta-León",710,{"$f":"VLOOKUP(A1904,Municipios!$B$2:$B$223,1,FALSE)","v":"Valencia"}]
["Toledo","León","Toledo-hasta-León",414,{"$f":"VLOOKUP(A1905,Municipios!$B$2:$B$223,1,FALSE)","v":"Toledo"}]
["Teruel","León","Teruel-hasta-León",558,{"$f":"VLOOKUP(A1906,Municipios!$B$2:$B$223,1,FALSE)","v":"Teruel"}]
["Tarragona","León","Tarragona-hasta-León",763,{"$f":"VLOOKUP(A1907,Municipios!$B$2:$B$223,1,FALSE)","v":"Tarragona"}]
["Soria","León","Soria-hasta-León",336,{"$f":"VLOOKUP(A1908,Municipios!$B$2:$B$223,1,FALSE)","v":"Soria"}]
["Sevilla","León","Sevilla-hasta-León",668,{"$f":"VLOOKUP(A1909,Municipios!$B$2:$B$223,1,FALSE)","v":"Sevilla"}]
["Segovia","León","Segovia-hasta-León",278,{"$f":"VLOOKUP(A1910,Municipios!$B$2:$B$223,1,FALSE)","v":"Segovia"}]
["Zaragoza","León","Zaragoza-hasta-León",500,{"$f":"VLOOKUP(A1911,Municipios!$B$2:$B$223,1,FALSE)","v":"Zaragoza"}]
["Donostia-San Sebastián","León","Donostia-San Sebastián-hasta-León",413,{"$f":"VLOOKUP(A1912,Municipios!$B$2:$B$223,1,FALSE)","v":"Donostia-San Sebastián"}]
["Lleida","León","Lleida-hasta-León",679,{"$f":"VLOOKUP(A1913,Municipios!$B$2:$B$223,1,FALSE)","v":"Lleida"}]
["Pontevedra","León","Pontevedra-hasta-León",366,{"$f":"VLOOKUP(A1914,Municipios!$B$2:$B$223,1,FALSE)","v":"Pontevedra"}]
["Pamplona/Iruña","León","Pamplona/Iruña-hasta-León",386,{"$f":"VLOOKUP(A1915,Municipios!$B$2:$B$223,1,FALSE)","v":"Pamplona/Iruña"}]
["Palencia","León","Palencia-hasta-León",125,{"$f":"VLOOKUP(A1916,Municipios!$B$2:$B$223,1,FALSE)","v":"Palencia"}]
["Oviedo","León","Oviedo-hasta-León",118,{"$f":"VLOOKUP(A1917,Municipios!$B$2:$B$223,1,FALSE)","v":"Oviedo"}]
["Ourense","León","Ourense-hasta-León",261,{"$f":"VLOOKUP(A1918,Municipios!$B$2:$B$223,1,FALSE)","v":"Ourense"}]
["Murcia","León",{"$f":"CONCATENATE(A1919,\"-hasta-\",B1919)","v":"Murcia-hasta-León"},751,{"$f":"VLOOKUP(A1919,Municipios!$B$2:$B$223,1,FALSE)","v":"Murcia"}]
["Málaga","León","Málaga-hasta-León",898,{"$f":"VLOOKUP(A1920,Municipios!$B$2:$B$223,1,FALSE)","v":"Málaga"}]
["Madrid","León","Madrid-hasta-León",336,{"$f":"VLOOKUP(A1921,Municipios!$B$2:$B$223,1,FALSE)","v":"Madrid"}]
["Lugo","León","Lugo-hasta-León",217,{"$f":"VLOOKUP(A1922,Municipios!$B$2:$B$223,1,FALSE)","v":"Lugo"}]
["Santander","León","Santander-hasta-León",341,{"$f":"VLOOKUP(A1923,Municipios!$B$2:$B$223,1,FALSE)","v":"Santander"}]
["Logroño","León","Logroño-hasta-León",329,{"$f":"VLOOKUP(A1924,Municipios!$B$2:$B$223,1,FALSE)","v":"Logroño"}]
["Teruel","Logroño","Teruel-hasta-Logroño",352,{"$f":"VLOOKUP(A1925,Municipios!$B$2:$B$223,1,FALSE)","v":"Teruel"}]
["Málaga","Logroño","Málaga-hasta-Logroño",883,{"$f":"VLOOKUP(A1926,Municipios!$B$2:$B$223,1,FALSE)","v":"Málaga"}]
["Zaragoza","Logroño","Zaragoza-hasta-Logroño",171,{"$f":"VLOOKUP(A1927,Municipios!$B$2:$B$223,1,FALSE)","v":"Zaragoza"}]
["Zamora","Logroño","Zamora-hasta-Logroño",351,{"$f":"VLOOKUP(A1928,Municipios!$B$2:$B$223,1,FALSE)","v":"Zamora"}]
["Vitoria-Gasteiz","Logroño","Vitoria-Gasteiz-hasta-Logroño",89,{"$f":"VLOOKUP(A1929,Municipios!$B$2:$B$223,1,FALSE)","v":"Vitoria-Gasteiz"}]
["Valladolid","Logroño","Valladolid-hasta-Logroño",264,{"$f":"VLOOKUP(A1930,Municipios!$B$2:$B$223,1,FALSE)","v":"Valladolid"}]
["Toledo","Logroño","Toledo-hasta-Logroño",454,{"$f":"VLOOKUP(A1931,Municipios!$B$2:$B$223,1,FALSE)","v":"Toledo"}]
["Tarragona","Logroño","Tarragona-hasta-Logroño",442,{"$f":"VLOOKUP(A1932,Municipios!$B$2:$B$223,1,FALSE)","v":"Tarragona"}]
["Soria","Logroño","Soria-hasta-Logroño",100,{"$f":"VLOOKUP(A1933,Municipios!$B$2:$B$223,1,FALSE)","v":"Soria"}]
["Sevilla","Logroño","Sevilla-hasta-Logroño",861,{"$f":"VLOOKUP(A1934,Municipios!$B$2:$B$223,1,FALSE)","v":"Sevilla"}]
["Segovia","Logroño","Segovia-hasta-Logroño",295,{"$f":"VLOOKUP(A1935,Municipios!$B$2:$B$223,1,FALSE)","v":"Segovia"}]
["Madrid","Logroño","Madrid-hasta-Logroño",369,{"$f":"VLOOKUP(A1936,Municipios!$B$2:$B$223,1,FALSE)","v":"Madrid"}]
["Lleida","Logroño","Lleida-hasta-Logroño",332,{"$f":"VLOOKUP(A1937,Municipios!$B$2:$B$223,1,FALSE)","v":"Lleida"}]
["Valencia","Logroño","Valencia-hasta-Logroño",551,{"$f":"VLOOKUP(A1938,Municipios!$B$2:$B$223,1,FALSE)","v":"Valencia"}]
["Santander","Logroño","Santander-hasta-Logroño",293,{"$f":"VLOOKUP(A1939,Municipios!$B$2:$B$223,1,FALSE)","v":"Santander"}]
["Murcia","Logroño","Murcia-hasta-Logroño",714,{"$f":"VLOOKUP(A1940,Municipios!$B$2:$B$223,1,FALSE)","v":"Murcia"}]
["Oviedo","Logroño","Oviedo-hasta-Logroño",446,{"$f":"VLOOKUP(A1941,Municipios!$B$2:$B$223,1,FALSE)","v":"Oviedo"}]
["Lugo","Logroño","Lugo-hasta-Logroño",550,{"$f":"VLOOKUP(A1942,Municipios!$B$2:$B$223,1,FALSE)","v":"Lugo"}]
["Palencia","Logroño","Palencia-hasta-Logroño",243,{"$f":"VLOOKUP(A1943,Municipios!$B$2:$B$223,1,FALSE)","v":"Palencia"}]
["Pamplona/Iruña","Logroño","Pamplona/Iruña-hasta-Logroño",93,{"$f":"VLOOKUP(A1944,Municipios!$B$2:$B$223,1,FALSE)","v":"Pamplona/Iruña"}]
["Pontevedra","Logroño","Pontevedra-hasta-Logroño",571,{"$f":"VLOOKUP(A1945,Municipios!$B$2:$B$223,1,FALSE)","v":"Pontevedra"}]
["Salamanca","Logroño","Salamanca-hasta-Logroño",381,{"$f":"VLOOKUP(A1946,Municipios!$B$2:$B$223,1,FALSE)","v":"Salamanca"}]
["Donostia-San Sebastián","Logroño","Donostia-San Sebastián-hasta-Logroño",206,{"$f":"VLOOKUP(A1947,Municipios!$B$2:$B$223,1,FALSE)","v":"Donostia-San Sebastián"}]
["Ourense","Logroño","Ourense-hasta-Logroño",478,{"$f":"VLOOKUP(A1948,Municipios!$B$2:$B$223,1,FALSE)","v":"Ourense"}]
["Soria","Lugo","Soria-hasta-Lugo",568,{"$f":"VLOOKUP(A1949,Municipios!$B$2:$B$223,1,FALSE)","v":"Soria"}]
["Valladolid","Lugo","Valladolid-hasta-Lugo",355,{"$f":"VLOOKUP(A1950,Municipios!$B$2:$B$223,1,FALSE)","v":"Valladolid"}]
["Teruel","Lugo","Teruel-hasta-Lugo",806,{"$f":"VLOOKUP(A1951,Municipios!$B$2:$B$223,1,FALSE)","v":"Teruel"}]
["Valencia","Lugo","Valencia-hasta-Lugo",868,{"$f":"VLOOKUP(A1952,Municipios!$B$2:$B$223,1,FALSE)","v":"Valencia"}]
["Vitoria-Gasteiz","Lugo","Vitoria-Gasteiz-hasta-Lugo",517,{"$f":"VLOOKUP(A1953,Municipios!$B$2:$B$223,1,FALSE)","v":"Vitoria-Gasteiz"}]
["Zamora","Lugo","Zamora-hasta-Lugo",304,{"$f":"VLOOKUP(A1954,Municipios!$B$2:$B$223,1,FALSE)","v":"Zamora"}]
["Zaragoza","Lugo","Zaragoza-hasta-Lugo",721,{"$f":"VLOOKUP(A1955,Municipios!$B$2:$B$223,1,FALSE)","v":"Zaragoza"}]
["Murcia","Lugo","Murcia-hasta-Lugo",909,{"$f":"VLOOKUP(A1956,Municipios!$B$2:$B$223,1,FALSE)","v":"Murcia"}]
["Sevilla","Lugo","Sevilla-hasta-Lugo",836,{"$f":"VLOOKUP(A1957,Municipios!$B$2:$B$223,1,FALSE)","v":"Sevilla"}]
["Tarragona","Lugo","Tarragona-hasta-Lugo",987,{"$f":"VLOOKUP(A1958,Municipios!$B$2:$B$223,1,FALSE)","v":"Tarragona"}]
["Ourense","Lugo","Ourense-hasta-Lugo",88,{"$f":"VLOOKUP(A1959,Municipios!$B$2:$B$223,1,FALSE)","v":"Ourense"}]
["Oviedo","Lugo","Oviedo-hasta-Lugo",233,{"$f":"VLOOKUP(A1960,Municipios!$B$2:$B$223,1,FALSE)","v":"Oviedo"}]
["Toledo","Lugo","Toledo-hasta-Lugo",578,{"$f":"VLOOKUP(A1961,Municipios!$B$2:$B$223,1,FALSE)","v":"Toledo"}]
["Segovia","Lugo","Segovia-hasta-Lugo",455,{"$f":"VLOOKUP(A1962,Municipios!$B$2:$B$223,1,FALSE)","v":"Segovia"}]
["Lleida","Lugo","Lleida-hasta-Lugo",899,{"$f":"VLOOKUP(A1963,Municipios!$B$2:$B$223,1,FALSE)","v":"Lleida"}]
["Madrid","Lugo","Madrid-hasta-Lugo",502,{"$f":"VLOOKUP(A1964,Municipios!$B$2:$B$223,1,FALSE)","v":"Madrid"}]
["Palencia","Lugo","Palencia-hasta-Lugo",343,{"$f":"VLOOKUP(A1965,Municipios!$B$2:$B$223,1,FALSE)","v":"Palencia"}]
["Pamplona/Iruña","Lugo","Pamplona/Iruña-hasta-Lugo",607,{"$f":"VLOOKUP(A1966,Municipios!$B$2:$B$223,1,FALSE)","v":"Pamplona/Iruña"}]
["Pontevedra","Lugo","Pontevedra-hasta-Lugo",146,{"$f":"VLOOKUP(A1967,Municipios!$B$2:$B$223,1,FALSE)","v":"Pontevedra"}]
["Salamanca","Lugo","Salamanca-hasta-Lugo",369,{"$f":"VLOOKUP(A1968,Municipios!$B$2:$B$223,1,FALSE)","v":"Salamanca"}]
["Donostia-San Sebastián","Lugo","Donostia-San Sebastián-hasta-Lugo",634,{"$f":"VLOOKUP(A1969,Municipios!$B$2:$B$223,1,FALSE)","v":"Donostia-San Sebastián"}]
["Santander","Lugo","Santander-hasta-Lugo",426,{"$f":"VLOOKUP(A1970,Municipios!$B$2:$B$223,1,FALSE)","v":"Santander"}]
["Málaga","Lugo","Málaga-hasta-Lugo",1065,{"$f":"VLOOKUP(A1971,Municipios!$B$2:$B$223,1,FALSE)","v":"Málaga"}]
["Teruel","Lleida","Teruel-hasta-Lleida",324,{"$f":"VLOOKUP(A1972,Municipios!$B$2:$B$223,1,FALSE)","v":"Teruel"}]
["Sevilla","Lleida","Sevilla-hasta-Lleida",1007,{"$f":"VLOOKUP(A1973,Municipios!$B$2:$B$223,1,FALSE)","v":"Sevilla"}]
["Soria","Lleida","Soria-hasta-Lleida",305,{"$f":"VLOOKUP(A1974,Municipios!$B$2:$B$223,1,FALSE)","v":"Soria"}]
["Tarragona","Lleida","Tarragona-hasta-Lleida",136,{"$f":"VLOOKUP(A1975,Municipios!$B$2:$B$223,1,FALSE)","v":"Tarragona"}]
["Toledo","Lleida","Toledo-hasta-Lleida",550,{"$f":"VLOOKUP(A1976,Municipios!$B$2:$B$223,1,FALSE)","v":"Toledo"}]
["Valencia","Lleida","Valencia-hasta-Lleida",386,{"$f":"VLOOKUP(A1977,Municipios!$B$2:$B$223,1,FALSE)","v":"Valencia"}]
["Valladolid","Lleida","Valladolid-hasta-Lleida",614,{"$f":"VLOOKUP(A1978,Municipios!$B$2:$B$223,1,FALSE)","v":"Valladolid"}]
["Vitoria-Gasteiz","Lleida","Vitoria-Gasteiz-hasta-Lleida",400,{"$f":"VLOOKUP(A1979,Municipios!$B$2:$B$223,1,FALSE)","v":"Vitoria-Gasteiz"}]
["Zaragoza","Lleida","Zaragoza-hasta-Lleida",140,{"$f":"VLOOKUP(A1980,Municipios!$B$2:$B$223,1,FALSE)","v":"Zaragoza"}]
["Donostia-San Sebastián","Lleida","Donostia-San Sebastián-hasta-Lleida",405,{"$f":"VLOOKUP(A1981,Municipios!$B$2:$B$223,1,FALSE)","v":"Donostia-San Sebastián"}]
["Zamora","Lleida","Zamora-hasta-Lleida",608,{"$f":"VLOOKUP(A1982,Municipios!$B$2:$B$223,1,FALSE)","v":"Zamora"}]
["Madrid","Lleida",{"$f":"CONCATENATE(A1983,\"-hasta-\",B1983)","v":"Madrid-hasta-Lleida"},452,{"$f":"VLOOKUP(A1983,Municipios!$B$2:$B$223,1,FALSE)","v":"Madrid"}]
["Salamanca","Lleida","Salamanca-hasta-Lleida",734,{"$f":"VLOOKUP(A1984,Municipios!$B$2:$B$223,1,FALSE)","v":"Salamanca"}]
["Pontevedra","Lleida","Pontevedra-hasta-Lleida",921,{"$f":"VLOOKUP(A1985,Municipios!$B$2:$B$223,1,FALSE)","v":"Pontevedra"}]
["Pamplona/Iruña","Lleida","Pamplona/Iruña-hasta-Lleida",315,{"$f":"VLOOKUP(A1986,Municipios!$B$2:$B$223,1,FALSE)","v":"Pamplona/Iruña"}]
["Palencia","Lleida","Palencia-hasta-Lleida",592,{"$f":"VLOOKUP(A1987,Municipios!$B$2:$B$223,1,FALSE)","v":"Palencia"}]
["Oviedo","Lleida","Oviedo-hasta-Lleida",796,{"$f":"VLOOKUP(A1988,Municipios!$B$2:$B$223,1,FALSE)","v":"Oviedo"}]
["Ourense","Lleida","Ourense-hasta-Lleida",827,{"$f":"VLOOKUP(A1989,Municipios!$B$2:$B$223,1,FALSE)","v":"Ourense"}]
["Murcia","Lleida","Murcia-hasta-Lleida",645,{"$f":"VLOOKUP(A1990,Municipios!$B$2:$B$223,1,FALSE)","v":"Murcia"}]
["Málaga","Lleida","Málaga-hasta-Lleida",1008,{"$f":"VLOOKUP(A1991,Municipios!$B$2:$B$223,1,FALSE)","v":"Málaga"}]
["Santander","Lleida","Santander-hasta-Lleida",642,{"$f":"VLOOKUP(A1992,Municipios!$B$2:$B$223,1,FALSE)","v":"Santander"}]
["Segovia","Lleida","Segovia-hasta-Lleida",554,{"$f":"VLOOKUP(A1993,Municipios!$B$2:$B$223,1,FALSE)","v":"Segovia"}]
["Sevilla","Madrid","Sevilla-hasta-Madrid",529,{"$f":"VLOOKUP(A1994,Municipios!$B$2:$B$223,1,FALSE)","v":"Sevilla"}]
["Soria","Madrid","Soria-hasta-Madrid",221,{"$f":"VLOOKUP(A1995,Municipios!$B$2:$B$223,1,FALSE)","v":"Soria"}]
["Tarragona","Madrid","Tarragona-hasta-Madrid",576,{"$f":"VLOOKUP(A1996,Municipios!$B$2:$B$223,1,FALSE)","v":"Tarragona"}]
["Teruel","Madrid","Teruel-hasta-Madrid",292,{"$f":"VLOOKUP(A1997,Municipios!$B$2:$B$223,1,FALSE)","v":"Teruel"}]
["Toledo","Madrid","Toledo-hasta-Madrid",68,{"$f":"VLOOKUP(A1998,Municipios!$B$2:$B$223,1,FALSE)","v":"Toledo"}]
["Valladolid","Madrid","Valladolid-hasta-Madrid",211,{"$f":"VLOOKUP(A1999,Municipios!$B$2:$B$223,1,FALSE)","v":"Valladolid"}]
["Zamora","Madrid","Zamora-hasta-Madrid",249,{"$f":"VLOOKUP(A2000,Municipios!$B$2:$B$223,1,FALSE)","v":"Zamora"}]
["Zaragoza","Madrid","Zaragoza-hasta-Madrid",312,{"$f":"VLOOKUP(A2001,Municipios!$B$2:$B$223,1,FALSE)","v":"Zaragoza"}]
["Valencia","Madrid","Valencia-hasta-Madrid",347,{"$f":"VLOOKUP(A2002,Municipios!$B$2:$B$223,1,FALSE)","v":"Valencia"}]
["Segovia","Madrid","Segovia-hasta-Madrid",90,{"$f":"VLOOKUP(A2003,Municipios!$B$2:$B$223,1,FALSE)","v":"Segovia"}]
["Ourense","Madrid","Ourense-hasta-Madrid",490,{"$f":"VLOOKUP(A2004,Municipios!$B$2:$B$223,1,FALSE)","v":"Ourense"}]
["Murcia","Madrid","Murcia-hasta-Madrid",388,{"$f":"VLOOKUP(A2005,Municipios!$B$2:$B$223,1,FALSE)","v":"Murcia"}]
["Málaga","Madrid","Málaga-hasta-Madrid",550,{"$f":"VLOOKUP(A2006,Municipios!$B$2:$B$223,1,FALSE)","v":"Málaga"}]
["Oviedo","Madrid","Oviedo-hasta-Madrid",434,{"$f":"VLOOKUP(A2007,Municipios!$B$2:$B$223,1,FALSE)","v":"Oviedo"}]
["Vitoria-Gasteiz","Madrid","Vitoria-Gasteiz-hasta-Madrid",334,{"$f":"VLOOKUP(A2008,Municipios!$B$2:$B$223,1,FALSE)","v":"Vitoria-Gasteiz"}]
["Palencia","Madrid","Palencia-hasta-Madrid",259,{"$f":"VLOOKUP(A2009,Municipios!$B$2:$B$223,1,FALSE)","v":"Palencia"}]
["Pamplona/Iruña","Madrid","Pamplona/Iruña-hasta-Madrid",424,{"$f":"VLOOKUP(A2010,Municipios!$B$2:$B$223,1,FALSE)","v":"Pamplona/Iruña"}]
["Pontevedra","Madrid","Pontevedra-hasta-Madrid",584,{"$f":"VLOOKUP(A2011,Municipios!$B$2:$B$223,1,FALSE)","v":"Pontevedra"}]
["Salamanca","Madrid","Salamanca-hasta-Madrid",204,{"$f":"VLOOKUP(A2012,Municipios!$B$2:$B$223,1,FALSE)","v":"Salamanca"}]
["Donostia-San Sebastián","Madrid","Donostia-San Sebastián-hasta-Madrid",451,{"$f":"VLOOKUP(A2013,Municipios!$B$2:$B$223,1,FALSE)","v":"Donostia-San Sebastián"}]
["Santander","Madrid","Santander-hasta-Madrid",388,{"$f":"VLOOKUP(A2014,Municipios!$B$2:$B$223,1,FALSE)","v":"Santander"}]
["Vitoria-Gasteiz","Málaga","Vitoria-Gasteiz-hasta-Málaga",901,{"$f":"VLOOKUP(A2015,Municipios!$B$2:$B$223,1,FALSE)","v":"Vitoria-Gasteiz"}]
["Sevilla","Málaga","Sevilla-hasta-Málaga",200,{"$f":"VLOOKUP(A2016,Municipios!$B$2:$B$223,1,FALSE)","v":"Sevilla"}]
["Zamora","Málaga","Zamora-hasta-Málaga",738,{"$f":"VLOOKUP(A2017,Municipios!$B$2:$B$223,1,FALSE)","v":"Zamora"}]
["Valladolid","Málaga","Valladolid-hasta-Málaga",767,{"$f":"VLOOKUP(A2018,Municipios!$B$2:$B$223,1,FALSE)","v":"Valladolid"}]
["Valencia","Málaga","Valencia-hasta-Málaga",663,{"$f":"VLOOKUP(A2019,Municipios!$B$2:$B$223,1,FALSE)","v":"Valencia"}]
["Toledo","Málaga","Toledo-hasta-Málaga",466,{"$f":"VLOOKUP(A2020,Municipios!$B$2:$B$223,1,FALSE)","v":"Toledo"}]
["Teruel","Málaga","Teruel-hasta-Málaga",752,{"$f":"VLOOKUP(A2021,Municipios!$B$2:$B$223,1,FALSE)","v":"Teruel"}]
["Tarragona","Málaga","Tarragona-hasta-Málaga",920,{"$f":"VLOOKUP(A2022,Municipios!$B$2:$B$223,1,FALSE)","v":"Tarragona"}]
["Soria","Málaga","Soria-hasta-Málaga",777,{"$f":"VLOOKUP(A2023,Municipios!$B$2:$B$223,1,FALSE)","v":"Soria"}]
["Ourense","Málaga","Ourense-hasta-Málaga",1030,{"$f":"VLOOKUP(A2024,Municipios!$B$2:$B$223,1,FALSE)","v":"Ourense"}]
["Segovia","Málaga","Segovia-hasta-Málaga",653,{"$f":"VLOOKUP(A2025,Municipios!$B$2:$B$223,1,FALSE)","v":"Segovia"}]
["Zaragoza","Málaga","Zaragoza-hasta-Málaga",868,{"$f":"VLOOKUP(A2026,Municipios!$B$2:$B$223,1,FALSE)","v":"Zaragoza"}]
["Murcia","Málaga","Murcia-hasta-Málaga",403,{"$f":"VLOOKUP(A2027,Municipios!$B$2:$B$223,1,FALSE)","v":"Murcia"}]
["Oviedo","Málaga","Oviedo-hasta-Málaga",992,{"$f":"VLOOKUP(A2028,Municipios!$B$2:$B$223,1,FALSE)","v":"Oviedo"}]
["Palencia","Málaga","Palencia-hasta-Málaga",835,{"$f":"VLOOKUP(A2029,Municipios!$B$2:$B$223,1,FALSE)","v":"Palencia"}]
["Pamplona/Iruña","Málaga","Pamplona/Iruña-hasta-Málaga",974,{"$f":"VLOOKUP(A2030,Municipios!$B$2:$B$223,1,FALSE)","v":"Pamplona/Iruña"}]
["Pontevedra","Málaga","Pontevedra-hasta-Málaga",1119,{"$f":"VLOOKUP(A2031,Municipios!$B$2:$B$223,1,FALSE)","v":"Pontevedra"}]
["Salamanca","Málaga","Salamanca-hasta-Málaga",673,{"$f":"VLOOKUP(A2032,Municipios!$B$2:$B$223,1,FALSE)","v":"Salamanca"}]
["Donostia-San Sebastián","Málaga","Donostia-San Sebastián-hasta-Málaga",1018,{"$f":"VLOOKUP(A2033,Municipios!$B$2:$B$223,1,FALSE)","v":"Donostia-San Sebastián"}]
["Santander","Málaga","Santander-hasta-Málaga",955,{"$f":"VLOOKUP(A2034,Municipios!$B$2:$B$223,1,FALSE)","v":"Santander"}]
["Zamora","Murcia","Zamora-hasta-Murcia",665,{"$f":"VLOOKUP(A2035,Municipios!$B$2:$B$223,1,FALSE)","v":"Zamora"}]
["Santander","Murcia","Santander-hasta-Murcia",790,{"$f":"VLOOKUP(A2036,Municipios!$B$2:$B$223,1,FALSE)","v":"Santander"}]
["Vitoria-Gasteiz","Murcia","Vitoria-Gasteiz-hasta-Murcia",736,{"$f":"VLOOKUP(A2037,Municipios!$B$2:$B$223,1,FALSE)","v":"Vitoria-Gasteiz"}]
["Valladolid","Murcia","Valladolid-hasta-Murcia",617,{"$f":"VLOOKUP(A2038,Municipios!$B$2:$B$223,1,FALSE)","v":"Valladolid"}]
["Valencia","Murcia","Valencia-hasta-Murcia",259,{"$f":"VLOOKUP(A2039,Municipios!$B$2:$B$223,1,FALSE)","v":"Valencia"}]
["Toledo","Murcia","Toledo-hasta-Murcia",432,{"$f":"VLOOKUP(A2040,Municipios!$B$2:$B$223,1,FALSE)","v":"Toledo"}]
["Teruel","Murcia","Teruel-hasta-Murcia",384,{"$f":"VLOOKUP(A2041,Municipios!$B$2:$B$223,1,FALSE)","v":"Teruel"}]
["Tarragona","Murcia","Tarragona-hasta-Murcia",517,{"$f":"VLOOKUP(A2042,Municipios!$B$2:$B$223,1,FALSE)","v":"Tarragona"}]
["Soria","Murcia","Soria-hasta-Murcia",554,{"$f":"VLOOKUP(A2043,Municipios!$B$2:$B$223,1,FALSE)","v":"Soria"}]
["Zaragoza","Murcia","Zaragoza-hasta-Murcia",548,{"$f":"VLOOKUP(A2044,Municipios!$B$2:$B$223,1,FALSE)","v":"Zaragoza"}]
["Pamplona/Iruña","Murcia","Pamplona/Iruña-hasta-Murcia",723,{"$f":"VLOOKUP(A2045,Municipios!$B$2:$B$223,1,FALSE)","v":"Pamplona/Iruña"}]
["Ourense","Murcia","Ourense-hasta-Murcia",897,{"$f":"VLOOKUP(A2046,Municipios!$B$2:$B$223,1,FALSE)","v":"Ourense"}]
["Sevilla","Murcia",{"$f":"CONCATENATE(A2047,\"-hasta-\",B2047)","v":"Sevilla-hasta-Murcia"},591,{"$f":"VLOOKUP(A2047,Municipios!$B$2:$B$223,1,FALSE)","v":"Sevilla"}]
["Palencia","Murcia","Palencia-hasta-Murcia",665,{"$f":"VLOOKUP(A2048,Municipios!$B$2:$B$223,1,FALSE)","v":"Palencia"}]
["Segovia","Murcia","Segovia-hasta-Murcia",506,{"$f":"VLOOKUP(A2049,Municipios!$B$2:$B$223,1,FALSE)","v":"Segovia"}]
["Pontevedra","Murcia","Pontevedra-hasta-Murcia",1002,{"$f":"VLOOKUP(A2050,Municipios!$B$2:$B$223,1,FALSE)","v":"Pontevedra"}]
["Salamanca","Murcia","Salamanca-hasta-Murcia",619,{"$f":"VLOOKUP(A2051,Municipios!$B$2:$B$223,1,FALSE)","v":"Salamanca"}]
["Donostia-San Sebastián","Murcia","Donostia-San Sebastián-hasta-Murcia",813,{"$f":"VLOOKUP(A2052,Municipios!$B$2:$B$223,1,FALSE)","v":"Donostia-San Sebastián"}]
["Oviedo","Murcia","Oviedo-hasta-Murcia",849,{"$f":"VLOOKUP(A2053,Municipios!$B$2:$B$223,1,FALSE)","v":"Oviedo"}]
["Zamora","Ourense","Zamora-hasta-Ourense",296,{"$f":"VLOOKUP(A2054,Municipios!$B$2:$B$223,1,FALSE)","v":"Zamora"}]
["Vitoria-Gasteiz","Ourense","Vitoria-Gasteiz-hasta-Ourense",445,{"$f":"VLOOKUP(A2055,Municipios!$B$2:$B$223,1,FALSE)","v":"Vitoria-Gasteiz"}]
["Zaragoza","Ourense","Zaragoza-hasta-Ourense",649,{"$f":"VLOOKUP(A2056,Municipios!$B$2:$B$223,1,FALSE)","v":"Zaragoza"}]
["Valencia","Ourense","Valencia-hasta-Ourense",856,{"$f":"VLOOKUP(A2057,Municipios!$B$2:$B$223,1,FALSE)","v":"Valencia"}]
["Toledo","Ourense","Toledo-hasta-Ourense",566,{"$f":"VLOOKUP(A2058,Municipios!$B$2:$B$223,1,FALSE)","v":"Toledo"}]
["Teruel","Ourense","Teruel-hasta-Ourense",831,{"$f":"VLOOKUP(A2059,Municipios!$B$2:$B$223,1,FALSE)","v":"Teruel"}]
["Segovia","Ourense","Segovia-hasta-Ourense",447,{"$f":"VLOOKUP(A2060,Municipios!$B$2:$B$223,1,FALSE)","v":"Segovia"}]
["Soria","Ourense","Soria-hasta-Ourense",553,{"$f":"VLOOKUP(A2061,Municipios!$B$2:$B$223,1,FALSE)","v":"Soria"}]
["Santander","Ourense","Santander-hasta-Ourense",604,{"$f":"VLOOKUP(A2062,Municipios!$B$2:$B$223,1,FALSE)","v":"Santander"}]
["Donostia-San Sebastián","Ourense","Donostia-San Sebastián-hasta-Ourense",562,{"$f":"VLOOKUP(A2063,Municipios!$B$2:$B$223,1,FALSE)","v":"Donostia-San Sebastián"}]
["Salamanca","Ourense","Salamanca-hasta-Ourense",361,{"$f":"VLOOKUP(A2064,Municipios!$B$2:$B$223,1,FALSE)","v":"Salamanca"}]
["Pamplona/Iruña","Ourense","Pamplona/Iruña-hasta-Ourense",535,{"$f":"VLOOKUP(A2065,Municipios!$B$2:$B$223,1,FALSE)","v":"Pamplona/Iruña"}]
["Palencia","Ourense","Palencia-hasta-Ourense",333,{"$f":"VLOOKUP(A2066,Municipios!$B$2:$B$223,1,FALSE)","v":"Palencia"}]
["Oviedo","Ourense","Oviedo-hasta-Ourense",379,{"$f":"VLOOKUP(A2067,Municipios!$B$2:$B$223,1,FALSE)","v":"Oviedo"}]
["Pontevedra","Ourense","Pontevedra-hasta-Ourense",94,{"$f":"VLOOKUP(A2068,Municipios!$B$2:$B$223,1,FALSE)","v":"Pontevedra"}]
["Sevilla","Ourense","Sevilla-hasta-Ourense",831,{"$f":"VLOOKUP(A2069,Municipios!$B$2:$B$223,1,FALSE)","v":"Sevilla"}]
["Valladolid","Ourense","Valladolid-hasta-Ourense",340,{"$f":"VLOOKUP(A2070,Municipios!$B$2:$B$223,1,FALSE)","v":"Valladolid"}]
["Tarragona","Ourense","Tarragona-hasta-Ourense",915,{"$f":"VLOOKUP(A2071,Municipios!$B$2:$B$223,1,FALSE)","v":"Tarragona"}]
["Ávila","Almería","Ávila-hasta-Almería",741,{"$f":"VLOOKUP(A2072,Municipios!$B$2:$B$223,1,FALSE)","v":"Ávila"}]
["Soria","Almería","Soria-hasta-Almería",760,{"$f":"VLOOKUP(A2073,Municipios!$B$2:$B$223,1,FALSE)","v":"Soria"}]
["Sevilla","Almería","Sevilla-hasta-Almería",410,{"$f":"VLOOKUP(A2074,Municipios!$B$2:$B$223,1,FALSE)","v":"Sevilla"}]
["Segovia","Almería","Segovia-hasta-Almería",721,{"$f":"VLOOKUP(A2075,Municipios!$B$2:$B$223,1,FALSE)","v":"Segovia"}]
["Santander","Almería","Santander-hasta-Almería",1005,{"$f":"VLOOKUP(A2076,Municipios!$B$2:$B$223,1,FALSE)","v":"Santander"}]
["Donostia-San Sebastián","Almería","Donostia-San Sebastián-hasta-Almería",1055,{"$f":"VLOOKUP(A2077,Municipios!$B$2:$B$223,1,FALSE)","v":"Donostia-San Sebastián"}]
["Tarragona","Almería","Tarragona-hasta-Almería",728,{"$f":"VLOOKUP(A2078,Municipios!$B$2:$B$223,1,FALSE)","v":"Tarragona"}]
["Pontevedra","Almería","Pontevedra-hasta-Almería",1214,{"$f":"VLOOKUP(A2079,Municipios!$B$2:$B$223,1,FALSE)","v":"Pontevedra"}]
["Zamora","Almería","Zamora-hasta-Almería",880,{"$f":"VLOOKUP(A2080,Municipios!$B$2:$B$223,1,FALSE)","v":"Zamora"}]
["Salamanca","Almería","Salamanca-hasta-Almería",835,{"$f":"VLOOKUP(A2081,Municipios!$B$2:$B$223,1,FALSE)","v":"Salamanca"}]
["Teruel","Almería","Teruel-hasta-Almería",608,{"$f":"VLOOKUP(A2082,Municipios!$B$2:$B$223,1,FALSE)","v":"Teruel"}]
["Toledo","Almería","Toledo-hasta-Almería",643,{"$f":"VLOOKUP(A2083,Municipios!$B$2:$B$223,1,FALSE)","v":"Toledo"}]
["Valencia","Almería","Valencia-hasta-Almería",476,{"$f":"VLOOKUP(A2084,Municipios!$B$2:$B$223,1,FALSE)","v":"Valencia"}]
["Vitoria-Gasteiz","Almería","Vitoria-Gasteiz-hasta-Almería",955,{"$f":"VLOOKUP(A2085,Municipios!$B$2:$B$223,1,FALSE)","v":"Vitoria-Gasteiz"}]
["Oviedo","Almería","Oviedo-hasta-Almería",1064,{"$f":"VLOOKUP(A2086,Municipios!$B$2:$B$223,1,FALSE)","v":"Oviedo"}]
["Zaragoza","Almería","Zaragoza-hasta-Almería",805,{"$f":"VLOOKUP(A2087,Municipios!$B$2:$B$223,1,FALSE)","v":"Zaragoza"}]
["Badajoz","Almería","Badajoz-hasta-Almería",671,{"$f":"VLOOKUP(A2088,Municipios!$B$2:$B$223,1,FALSE)","v":"Badajoz"}]
["Barcelona","Almería","Barcelona-hasta-Almería",826,{"$f":"VLOOKUP(A2089,Municipios!$B$2:$B$223,1,FALSE)","v":"Barcelona"}]
["Bilbao","Almería","Bilbao-hasta-Almería",974,{"$f":"VLOOKUP(A2090,Municipios!$B$2:$B$223,1,FALSE)","v":"Bilbao"}]
["Burgos","Almería","Burgos-hasta-Almería",830,{"$f":"VLOOKUP(A2091,Municipios!$B$2:$B$223,1,FALSE)","v":"Burgos"}]
["Cáceres","Almería","Cáceres-hasta-Almería",671,{"$f":"VLOOKUP(A2092,Municipios!$B$2:$B$223,1,FALSE)","v":"Cáceres"}]
["Valladolid","Almería","Valladolid-hasta-Almería",829,{"$f":"VLOOKUP(A2093,Municipios!$B$2:$B$223,1,FALSE)","v":"Valladolid"}]
["Granada","Almería","Granada-hasta-Almería",185,{"$f":"VLOOKUP(A2094,Municipios!$B$2:$B$223,1,FALSE)","v":"Granada"}]
["Cádiz","Almería","Cádiz-hasta-Almería",475,{"$f":"VLOOKUP(A2095,Municipios!$B$2:$B$223,1,FALSE)","v":"Cádiz"}]
["Castellón de la Plana/Castelló de la Plana","Almería","Castellón de la Plana/Castelló de la Plana-hasta-Almería",543,{"$f":"VLOOKUP(A2096,Municipios!$B$2:$B$223,1,FALSE)","v":"Castellón de la Plana/Castelló de la Plana"}]
["Ciudad Real","Almería","Ciudad Real-hasta-Almería",494,{"$f":"VLOOKUP(A2097,Municipios!$B$2:$B$223,1,FALSE)","v":"Ciudad Real"}]
["Córdoba","Almería","Córdoba-hasta-Almería",374,{"$f":"VLOOKUP(A2098,Municipios!$B$2:$B$223,1,FALSE)","v":"Córdoba"}]
["Coruña (A)","Almería","Coruña (A)-hasta-Almería",1301,{"$f":"VLOOKUP(A2099,Municipios!$B$2:$B$223,1,FALSE)","v":"Coruña (A)"}]
["Pamplona/Iruña","Almería","Pamplona/Iruña-hasta-Almería",980,{"$f":"VLOOKUP(A2100,Municipios!$B$2:$B$223,1,FALSE)","v":"Pamplona/Iruña"}]
["Girona","Almería","Girona-hasta-Almería",909,{"$f":"VLOOKUP(A2101,Municipios!$B$2:$B$223,1,FALSE)","v":"Girona"}]
["Palencia","Almería","Palencia-hasta-Almería",863,{"$f":"VLOOKUP(A2102,Municipios!$B$2:$B$223,1,FALSE)","v":"Palencia"}]
["Guadalajara","Almería","Guadalajara-hasta-Almería",651,{"$f":"VLOOKUP(A2103,Municipios!$B$2:$B$223,1,FALSE)","v":"Guadalajara"}]
["Huelva","Almería","Huelva-hasta-Almería",495,{"$f":"VLOOKUP(A2104,Municipios!$B$2:$B$223,1,FALSE)","v":"Huelva"}]
["Murcia","Almería","Murcia-hasta-Almería",212,{"$f":"VLOOKUP(A2105,Municipios!$B$2:$B$223,1,FALSE)","v":"Murcia"}]
["Cuenca","Almería","Cuenca-hasta-Almería",490,{"$f":"VLOOKUP(A2106,Municipios!$B$2:$B$223,1,FALSE)","v":"Cuenca"}]
["Ourense","Almería","Ourense-hasta-Almería",1117,{"$f":"VLOOKUP(A2107,Municipios!$B$2:$B$223,1,FALSE)","v":"Ourense"}]
["Huesca","Almería","Huesca-hasta-Almería",878,{"$f":"VLOOKUP(A2108,Municipios!$B$2:$B$223,1,FALSE)","v":"Huesca"}]
["Málaga","Almería","Málaga-hasta-Almería",204,{"$f":"VLOOKUP(A2109,Municipios!$B$2:$B$223,1,FALSE)","v":"Málaga"}]
["Madrid","Almería","Madrid-hasta-Almería",604,{"$f":"VLOOKUP(A2110,Municipios!$B$2:$B$223,1,FALSE)","v":"Madrid"}]
["Lleida","Almería",{"$f":"CONCATENATE(A2111,\"-hasta-\",B2111)","v":"Lleida-hasta-Almería"},919,{"$f":"VLOOKUP(A2111,Municipios!$B$2:$B$223,1,FALSE)","v":"Lleida"}]
["Lugo","Almería","Lugo-hasta-Almería",1106,{"$f":"VLOOKUP(A2112,Municipios!$B$2:$B$223,1,FALSE)","v":"Lugo"}]
["Logroño","Almería","Logroño-hasta-Almería",973,{"$f":"VLOOKUP(A2113,Municipios!$B$2:$B$223,1,FALSE)","v":"Logroño"}]
["León","Almería","León-hasta-Almería",967,{"$f":"VLOOKUP(A2114,Municipios!$B$2:$B$223,1,FALSE)","v":"León"}]
["Jaén","Almería","Jaén-hasta-Almería",280,{"$f":"VLOOKUP(A2115,Municipios!$B$2:$B$223,1,FALSE)","v":"Jaén"}]
["Toledo","Oviedo","Toledo-hasta-Oviedo",512,{"$f":"VLOOKUP(A2116,Municipios!$B$2:$B$223,1,FALSE)","v":"Toledo"}]
["Zaragoza","Oviedo","Zaragoza-hasta-Oviedo",621,{"$f":"VLOOKUP(A2117,Municipios!$B$2:$B$223,1,FALSE)","v":"Zaragoza"}]
["Zamora","Oviedo","Zamora-hasta-Oviedo",259,{"$f":"VLOOKUP(A2118,Municipios!$B$2:$B$223,1,FALSE)","v":"Zamora"}]
["Vitoria-Gasteiz","Oviedo","Vitoria-Gasteiz-hasta-Oviedo",360,{"$f":"VLOOKUP(A2119,Municipios!$B$2:$B$223,1,FALSE)","v":"Vitoria-Gasteiz"}]
["Valencia","Oviedo","Valencia-hasta-Oviedo",808,{"$f":"VLOOKUP(A2120,Municipios!$B$2:$B$223,1,FALSE)","v":"Valencia"}]
["Teruel","Oviedo","Teruel-hasta-Oviedo",678,{"$f":"VLOOKUP(A2121,Municipios!$B$2:$B$223,1,FALSE)","v":"Teruel"}]
["Tarragona","Oviedo","Tarragona-hasta-Oviedo",883,{"$f":"VLOOKUP(A2122,Municipios!$B$2:$B$223,1,FALSE)","v":"Tarragona"}]
["Salamanca","Oviedo","Salamanca-hasta-Oviedo",321,{"$f":"VLOOKUP(A2123,Municipios!$B$2:$B$223,1,FALSE)","v":"Salamanca"}]
["Palencia","Oviedo","Palencia-hasta-Oviedo",245,{"$f":"VLOOKUP(A2124,Municipios!$B$2:$B$223,1,FALSE)","v":"Palencia"}]
["Pontevedra","Oviedo","Pontevedra-hasta-Oviedo",384,{"$f":"VLOOKUP(A2125,Municipios!$B$2:$B$223,1,FALSE)","v":"Pontevedra"}]
["Donostia-San Sebastián","Oviedo","Donostia-San Sebastián-hasta-Oviedo",398,{"$f":"VLOOKUP(A2126,Municipios!$B$2:$B$223,1,FALSE)","v":"Donostia-San Sebastián"}]
["Valladolid","Oviedo","Valladolid-hasta-Oviedo",256,{"$f":"VLOOKUP(A2127,Municipios!$B$2:$B$223,1,FALSE)","v":"Valladolid"}]
["Santander","Oviedo","Santander-hasta-Oviedo",193,{"$f":"VLOOKUP(A2128,Municipios!$B$2:$B$223,1,FALSE)","v":"Santander"}]
["Soria","Oviedo","Soria-hasta-Oviedo",456,{"$f":"VLOOKUP(A2129,Municipios!$B$2:$B$223,1,FALSE)","v":"Soria"}]
["Segovia","Oviedo","Segovia-hasta-Oviedo",398,{"$f":"VLOOKUP(A2130,Municipios!$B$2:$B$223,1,FALSE)","v":"Segovia"}]
["Sevilla","Oviedo","Sevilla-hasta-Oviedo",788,{"$f":"VLOOKUP(A2131,Municipios!$B$2:$B$223,1,FALSE)","v":"Sevilla"}]
["Pamplona/Iruña","Oviedo","Pamplona/Iruña-hasta-Oviedo",450,{"$f":"VLOOKUP(A2132,Municipios!$B$2:$B$223,1,FALSE)","v":"Pamplona/Iruña"}]
["Vitoria-Gasteiz","Palencia","Vitoria-Gasteiz-hasta-Palencia",208,{"$f":"VLOOKUP(A2133,Municipios!$B$2:$B$223,1,FALSE)","v":"Vitoria-Gasteiz"}]
["Tarragona","Palencia","Tarragona-hasta-Palencia",687,{"$f":"VLOOKUP(A2134,Municipios!$B$2:$B$223,1,FALSE)","v":"Tarragona"}]
["Zamora","Palencia","Zamora-hasta-Palencia",157,{"$f":"VLOOKUP(A2135,Municipios!$B$2:$B$223,1,FALSE)","v":"Zamora"}]
["Valladolid","Palencia","Valladolid-hasta-Palencia",51,{"$f":"VLOOKUP(A2136,Municipios!$B$2:$B$223,1,FALSE)","v":"Valladolid"}]
["Valencia","Palencia","Valencia-hasta-Palencia",624,{"$f":"VLOOKUP(A2137,Municipios!$B$2:$B$223,1,FALSE)","v":"Valencia"}]
["Toledo","Palencia","Toledo-hasta-Palencia",340,{"$f":"VLOOKUP(A2138,Municipios!$B$2:$B$223,1,FALSE)","v":"Toledo"}]
["Teruel","Palencia","Teruel-hasta-Palencia",449,{"$f":"VLOOKUP(A2139,Municipios!$B$2:$B$223,1,FALSE)","v":"Teruel"}]
["Pontevedra","Palencia","Pontevedra-hasta-Palencia",492,{"$f":"VLOOKUP(A2140,Municipios!$B$2:$B$223,1,FALSE)","v":"Pontevedra"}]
["Sevilla","Palencia","Sevilla-hasta-Palencia",680,{"$f":"VLOOKUP(A2141,Municipios!$B$2:$B$223,1,FALSE)","v":"Sevilla"}]
["Segovia","Palencia","Segovia-hasta-Palencia",210,{"$f":"VLOOKUP(A2142,Municipios!$B$2:$B$223,1,FALSE)","v":"Segovia"}]
["Santander","Palencia","Santander-hasta-Palencia",194,{"$f":"VLOOKUP(A2143,Municipios!$B$2:$B$223,1,FALSE)","v":"Santander"}]
["Donostia-San Sebastián","Palencia","Donostia-San Sebastián-hasta-Palencia",325,{"$f":"VLOOKUP(A2144,Municipios!$B$2:$B$223,1,FALSE)","v":"Donostia-San Sebastián"}]
["Pamplona/Iruña","Palencia","Pamplona/Iruña-hasta-Palencia",298,{"$f":"VLOOKUP(A2145,Municipios!$B$2:$B$223,1,FALSE)","v":"Pamplona/Iruña"}]
["Salamanca","Palencia","Salamanca-hasta-Palencia",163,{"$f":"VLOOKUP(A2146,Municipios!$B$2:$B$223,1,FALSE)","v":"Salamanca"}]
["Soria","Palencia","Soria-hasta-Palencia",226,{"$f":"VLOOKUP(A2147,Municipios!$B$2:$B$223,1,FALSE)","v":"Soria"}]
["Zaragoza","Palencia","Zaragoza-hasta-Palencia",414,{"$f":"VLOOKUP(A2148,Municipios!$B$2:$B$223,1,FALSE)","v":"Zaragoza"}]
["Toledo","Pamplona/Iruña","Toledo-hasta-Pamplona/Iruña",511,{"$f":"VLOOKUP(A2149,Municipios!$B$2:$B$223,1,FALSE)","v":"Toledo"}]
["Valencia","Pamplona/Iruña","Valencia-hasta-Pamplona/Iruña",555,{"$f":"VLOOKUP(A2150,Municipios!$B$2:$B$223,1,FALSE)","v":"Valencia"}]
["Valladolid","Pamplona/Iruña","Valladolid-hasta-Pamplona/Iruña",319,{"$f":"VLOOKUP(A2151,Municipios!$B$2:$B$223,1,FALSE)","v":"Valladolid"}]
["Vitoria-Gasteiz","Pamplona/Iruña","Vitoria-Gasteiz-hasta-Pamplona/Iruña",90,{"$f":"VLOOKUP(A2152,Municipios!$B$2:$B$223,1,FALSE)","v":"Vitoria-Gasteiz"}]
["Zaragoza","Pamplona/Iruña","Zaragoza-hasta-Pamplona/Iruña",175,{"$f":"VLOOKUP(A2153,Municipios!$B$2:$B$223,1,FALSE)","v":"Zaragoza"}]
["Soria","Pamplona/Iruña","Soria-hasta-Pamplona/Iruña",184,{"$f":"VLOOKUP(A2154,Municipios!$B$2:$B$223,1,FALSE)","v":"Soria"}]
["Zamora","Pamplona/Iruña","Zamora-hasta-Pamplona/Iruña",409,{"$f":"VLOOKUP(A2155,Municipios!$B$2:$B$223,1,FALSE)","v":"Zamora"}]
["Tarragona","Pamplona/Iruña","Tarragona-hasta-Pamplona/Iruña",448,{"$f":"VLOOKUP(A2156,Municipios!$B$2:$B$223,1,FALSE)","v":"Tarragona"}]
["Sevilla","Pamplona/Iruña","Sevilla-hasta-Pamplona/Iruña",969,{"$f":"VLOOKUP(A2157,Municipios!$B$2:$B$223,1,FALSE)","v":"Sevilla"}]
["Segovia","Pamplona/Iruña","Segovia-hasta-Pamplona/Iruña",395,{"$f":"VLOOKUP(A2158,Municipios!$B$2:$B$223,1,FALSE)","v":"Segovia"}]
["Santander","Pamplona/Iruña","Santander-hasta-Pamplona/Iruña",295,{"$f":"VLOOKUP(A2159,Municipios!$B$2:$B$223,1,FALSE)","v":"Santander"}]
["Donostia-San Sebastián","Pamplona/Iruña","Donostia-San Sebastián-hasta-Pamplona/Iruña",90,{"$f":"VLOOKUP(A2160,Municipios!$B$2:$B$223,1,FALSE)","v":"Donostia-San Sebastián"}]
["Salamanca","Pamplona/Iruña","Salamanca-hasta-Pamplona/Iruña",440,{"$f":"VLOOKUP(A2161,Municipios!$B$2:$B$223,1,FALSE)","v":"Salamanca"}]
["Pontevedra","Pamplona/Iruña","Pontevedra-hasta-Pamplona/Iruña",629,{"$f":"VLOOKUP(A2162,Municipios!$B$2:$B$223,1,FALSE)","v":"Pontevedra"}]
["Teruel","Pamplona/Iruña","Teruel-hasta-Pamplona/Iruña",356,{"$f":"VLOOKUP(A2163,Municipios!$B$2:$B$223,1,FALSE)","v":"Teruel"}]
["Valencia","Pontevedra","Valencia-hasta-Pontevedra",961,{"$f":"VLOOKUP(A2164,Municipios!$B$2:$B$223,1,FALSE)","v":"Valencia"}]
["Tarragona","Pontevedra","Tarragona-hasta-Pontevedra",1009,{"$f":"VLOOKUP(A2165,Municipios!$B$2:$B$223,1,FALSE)","v":"Tarragona"}]
["Zaragoza","Pontevedra","Zaragoza-hasta-Pontevedra",743,{"$f":"VLOOKUP(A2166,Municipios!$B$2:$B$223,1,FALSE)","v":"Zaragoza"}]
["Zamora","Pontevedra","Zamora-hasta-Pontevedra",390,{"$f":"VLOOKUP(A2167,Municipios!$B$2:$B$223,1,FALSE)","v":"Zamora"}]
["Vitoria-Gasteiz","Pontevedra","Vitoria-Gasteiz-hasta-Pontevedra",539,{"$f":"VLOOKUP(A2168,Municipios!$B$2:$B$223,1,FALSE)","v":"Vitoria-Gasteiz"}]
["Valladolid","Pontevedra","Valladolid-hasta-Pontevedra",445,{"$f":"VLOOKUP(A2169,Municipios!$B$2:$B$223,1,FALSE)","v":"Valladolid"}]
["Salamanca","Pontevedra","Salamanca-hasta-Pontevedra",455,{"$f":"VLOOKUP(A2170,Municipios!$B$2:$B$223,1,FALSE)","v":"Salamanca"}]
["Donostia-San Sebastián","Pontevedra","Donostia-San Sebastián-hasta-Pontevedra",656,{"$f":"VLOOKUP(A2171,Municipios!$B$2:$B$223,1,FALSE)","v":"Donostia-San Sebastián"}]
["Soria","Pontevedra","Soria-hasta-Pontevedra",646,{"$f":"VLOOKUP(A2172,Municipios!$B$2:$B$223,1,FALSE)","v":"Soria"}]
["Sevilla","Pontevedra","Sevilla-hasta-Pontevedra",924,{"$f":"VLOOKUP(A2173,Municipios!$B$2:$B$223,1,FALSE)","v":"Sevilla"}]
["Segovia","Pontevedra","Segovia-hasta-Pontevedra",540,{"$f":"VLOOKUP(A2174,Municipios!$B$2:$B$223,1,FALSE)","v":"Segovia"}]
["Santander","Pontevedra",{"$f":"CONCATENATE(A2175,\"-hasta-\",B2175)","v":"Santander-hasta-Pontevedra"},698,{"$f":"VLOOKUP(A2175,Municipios!$B$2:$B$223,1,FALSE)","v":"Santander"}]
["Toledo","Pontevedra","Toledo-hasta-Pontevedra",671,{"$f":"VLOOKUP(A2176,Municipios!$B$2:$B$223,1,FALSE)","v":"Toledo"}]
["Teruel","Pontevedra","Teruel-hasta-Pontevedra",869,{"$f":"VLOOKUP(A2177,Municipios!$B$2:$B$223,1,FALSE)","v":"Teruel"}]
["Tarragona","Salamanca","Tarragona-hasta-Salamanca",792,{"$f":"VLOOKUP(A2178,Municipios!$B$2:$B$223,1,FALSE)","v":"Tarragona"}]
["Zaragoza","Salamanca","Zaragoza-hasta-Salamanca",552,{"$f":"VLOOKUP(A2179,Municipios!$B$2:$B$223,1,FALSE)","v":"Zaragoza"}]
["Zamora","Salamanca","Zamora-hasta-Salamanca",65,{"$f":"VLOOKUP(A2180,Municipios!$B$2:$B$223,1,FALSE)","v":"Zamora"}]
["Vitoria-Gasteiz","Salamanca","Vitoria-Gasteiz-hasta-Salamanca",350,{"$f":"VLOOKUP(A2181,Municipios!$B$2:$B$223,1,FALSE)","v":"Vitoria-Gasteiz"}]
["Valladolid","Salamanca","Valladolid-hasta-Salamanca",120,{"$f":"VLOOKUP(A2182,Municipios!$B$2:$B$223,1,FALSE)","v":"Valladolid"}]
["Valencia","Salamanca","Valencia-hasta-Salamanca",578,{"$f":"VLOOKUP(A2183,Municipios!$B$2:$B$223,1,FALSE)","v":"Valencia"}]
["Teruel","Salamanca","Teruel-hasta-Salamanca",508,{"$f":"VLOOKUP(A2184,Municipios!$B$2:$B$223,1,FALSE)","v":"Teruel"}]
["Soria","Salamanca","Soria-hasta-Salamanca",323,{"$f":"VLOOKUP(A2185,Municipios!$B$2:$B$223,1,FALSE)","v":"Soria"}]
["Sevilla","Salamanca","Sevilla-hasta-Salamanca",460,{"$f":"VLOOKUP(A2186,Municipios!$B$2:$B$223,1,FALSE)","v":"Sevilla"}]
["Segovia","Salamanca","Segovia-hasta-Salamanca",160,{"$f":"VLOOKUP(A2187,Municipios!$B$2:$B$223,1,FALSE)","v":"Segovia"}]
["Santander","Salamanca","Santander-hasta-Salamanca",394,{"$f":"VLOOKUP(A2188,Municipios!$B$2:$B$223,1,FALSE)","v":"Santander"}]
["Donostia-San Sebastián","Salamanca","Donostia-San Sebastián-hasta-Salamanca",467,{"$f":"VLOOKUP(A2189,Municipios!$B$2:$B$223,1,FALSE)","v":"Donostia-San Sebastián"}]
["Toledo","Salamanca","Toledo-hasta-Salamanca",283,{"$f":"VLOOKUP(A2190,Municipios!$B$2:$B$223,1,FALSE)","v":"Toledo"}]
["Valencia","Donostia/San Sebastián","Valencia-hasta-Donostia/San Sebastián",645,{"$f":"VLOOKUP(A2191,Municipios!$B$2:$B$223,1,FALSE)","v":"Valencia"}]
["Soria","Donostia/San Sebastián","Soria-hasta-Donostia/San Sebastián",312,{"$f":"VLOOKUP(A2192,Municipios!$B$2:$B$223,1,FALSE)","v":"Soria"}]
["Zaragoza","Donostia/San Sebastián","Zaragoza-hasta-Donostia/San Sebastián",265,{"$f":"VLOOKUP(A2193,Municipios!$B$2:$B$223,1,FALSE)","v":"Zaragoza"}]
["Zamora","Donostia/San Sebastián","Zamora-hasta-Donostia/San Sebastián",436,{"$f":"VLOOKUP(A2194,Municipios!$B$2:$B$223,1,FALSE)","v":"Zamora"}]
["Vitoria-Gasteiz","Donostia/San Sebastián","Vitoria-Gasteiz-hasta-Donostia/San Sebastián",117,{"$f":"VLOOKUP(A2195,Municipios!$B$2:$B$223,1,FALSE)","v":"Vitoria-Gasteiz"}]
["Valladolid","Donostia/San Sebastián","Valladolid-hasta-Donostia/San Sebastián",346,{"$f":"VLOOKUP(A2196,Municipios!$B$2:$B$223,1,FALSE)","v":"Valladolid"}]
["Tarragona","Donostia/San Sebastián","Tarragona-hasta-Donostia/San Sebastián",538,{"$f":"VLOOKUP(A2197,Municipios!$B$2:$B$223,1,FALSE)","v":"Tarragona"}]
["Sevilla","Donostia/San Sebastián","Sevilla-hasta-Donostia/San Sebastián",996,{"$f":"VLOOKUP(A2198,Municipios!$B$2:$B$223,1,FALSE)","v":"Sevilla"}]
["Segovia","Donostia/San Sebastián","Segovia-hasta-Donostia/San Sebastián",442,{"$f":"VLOOKUP(A2199,Municipios!$B$2:$B$223,1,FALSE)","v":"Segovia"}]
["Santander","Donostia/San Sebastián","Santander-hasta-Donostia/San Sebastián",205,{"$f":"VLOOKUP(A2200,Municipios!$B$2:$B$223,1,FALSE)","v":"Santander"}]
["Toledo","Donostia/San Sebastián","Toledo-hasta-Donostia/San Sebastián",538,{"$f":"VLOOKUP(A2201,Municipios!$B$2:$B$223,1,FALSE)","v":"Toledo"}]
["Teruel","Donostia/San Sebastián","Teruel-hasta-Donostia/San Sebastián",446,{"$f":"VLOOKUP(A2202,Municipios!$B$2:$B$223,1,FALSE)","v":"Teruel"}]
["Tarragona","Santander","Tarragona-hasta-Santander",730,{"$f":"VLOOKUP(A2203,Municipios!$B$2:$B$223,1,FALSE)","v":"Tarragona"}]
["Zaragoza","Santander","Zaragoza-hasta-Santander",395,{"$f":"VLOOKUP(A2204,Municipios!$B$2:$B$223,1,FALSE)","v":"Zaragoza"}]
["Zamora","Santander","Zamora-hasta-Santander",351,{"$f":"VLOOKUP(A2205,Municipios!$B$2:$B$223,1,FALSE)","v":"Zamora"}]
["Vitoria-Gasteiz","Santander","Vitoria-Gasteiz-hasta-Santander",167,{"$f":"VLOOKUP(A2206,Municipios!$B$2:$B$223,1,FALSE)","v":"Vitoria-Gasteiz"}]
["Valladolid","Santander","Valladolid-hasta-Santander",253,{"$f":"VLOOKUP(A2207,Municipios!$B$2:$B$223,1,FALSE)","v":"Valladolid"}]
["Valencia","Santander","Valencia-hasta-Santander",749,{"$f":"VLOOKUP(A2208,Municipios!$B$2:$B$223,1,FALSE)","v":"Valencia"}]
["Toledo","Santander","Toledo-hasta-Santander",474,{"$f":"VLOOKUP(A2209,Municipios!$B$2:$B$223,1,FALSE)","v":"Toledo"}]
["Teruel","Santander","Teruel-hasta-Santander",526,{"$f":"VLOOKUP(A2210,Municipios!$B$2:$B$223,1,FALSE)","v":"Teruel"}]
["Soria","Santander","Soria-hasta-Santander",302,{"$f":"VLOOKUP(A2211,Municipios!$B$2:$B$223,1,FALSE)","v":"Soria"}]
["Sevilla","Santander","Sevilla-hasta-Santander",933,{"$f":"VLOOKUP(A2212,Municipios!$B$2:$B$223,1,FALSE)","v":"Sevilla"}]
["Segovia","Santander","Segovia-hasta-Santander",352,{"$f":"VLOOKUP(A2213,Municipios!$B$2:$B$223,1,FALSE)","v":"Segovia"}]
["Toledo","Segovia","Toledo-hasta-Segovia",169,{"$f":"VLOOKUP(A2214,Municipios!$B$2:$B$223,1,FALSE)","v":"Toledo"}]
["Zaragoza","Segovia","Zaragoza-hasta-Segovia",414,{"$f":"VLOOKUP(A2215,Municipios!$B$2:$B$223,1,FALSE)","v":"Zaragoza"}]
["Zamora","Segovia","Zamora-hasta-Segovia",284,{"$f":"VLOOKUP(A2216,Municipios!$B$2:$B$223,1,FALSE)","v":"Zamora"}]
["Vitoria-Gasteiz","Segovia","Vitoria-Gasteiz-hasta-Segovia",305,{"$f":"VLOOKUP(A2217,Municipios!$B$2:$B$223,1,FALSE)","v":"Vitoria-Gasteiz"}]
["Valencia","Segovia","Valencia-hasta-Segovia",465,{"$f":"VLOOKUP(A2218,Municipios!$B$2:$B$223,1,FALSE)","v":"Valencia"}]
["Valladolid","Segovia","Valladolid-hasta-Segovia",141,{"$f":"VLOOKUP(A2219,Municipios!$B$2:$B$223,1,FALSE)","v":"Valladolid"}]
["Teruel","Segovia","Teruel-hasta-Segovia",394,{"$f":"VLOOKUP(A2220,Municipios!$B$2:$B$223,1,FALSE)","v":"Teruel"}]
["Tarragona","Segovia","Tarragona-hasta-Segovia",679,{"$f":"VLOOKUP(A2221,Municipios!$B$2:$B$223,1,FALSE)","v":"Tarragona"}]
["Soria","Segovia","Soria-hasta-Segovia",190,{"$f":"VLOOKUP(A2222,Municipios!$B$2:$B$223,1,FALSE)","v":"Soria"}]
["Sevilla","Segovia","Sevilla-hasta-Segovia",632,{"$f":"VLOOKUP(A2223,Municipios!$B$2:$B$223,1,FALSE)","v":"Sevilla"}]
["Toledo","Sevilla","Toledo-hasta-Sevilla",445,{"$f":"VLOOKUP(A2224,Municipios!$B$2:$B$223,1,FALSE)","v":"Toledo"}]
["Zaragoza","Sevilla","Zaragoza-hasta-Sevilla",846,{"$f":"VLOOKUP(A2225,Municipios!$B$2:$B$223,1,FALSE)","v":"Zaragoza"}]
["Zamora","Sevilla","Zamora-hasta-Sevilla",538,{"$f":"VLOOKUP(A2226,Municipios!$B$2:$B$223,1,FALSE)","v":"Zamora"}]
["Vitoria-Gasteiz","Sevilla","Vitoria-Gasteiz-hasta-Sevilla",879,{"$f":"VLOOKUP(A2227,Municipios!$B$2:$B$223,1,FALSE)","v":"Vitoria-Gasteiz"}]
["Valencia","Sevilla","Valencia-hasta-Sevilla",686,{"$f":"VLOOKUP(A2228,Municipios!$B$2:$B$223,1,FALSE)","v":"Valencia"}]
["Teruel","Sevilla","Teruel-hasta-Sevilla",721,{"$f":"VLOOKUP(A2229,Municipios!$B$2:$B$223,1,FALSE)","v":"Teruel"}]
["Tarragona","Sevilla","Tarragona-hasta-Sevilla",941,{"$f":"VLOOKUP(A2230,Municipios!$B$2:$B$223,1,FALSE)","v":"Tarragona"}]
["Soria","Sevilla","Soria-hasta-Sevilla",755,{"$f":"VLOOKUP(A2231,Municipios!$B$2:$B$223,1,FALSE)","v":"Soria"}]
["Valladolid","Sevilla","Valladolid-hasta-Sevilla",593,{"$f":"VLOOKUP(A2232,Municipios!$B$2:$B$223,1,FALSE)","v":"Valladolid"}]
["Valladolid","Soria","Valladolid-hasta-Soria",204,{"$f":"VLOOKUP(A2233,Municipios!$B$2:$B$223,1,FALSE)","v":"Valladolid"}]
["Zamora","Soria","Zamora-hasta-Soria",302,{"$f":"VLOOKUP(A2234,Municipios!$B$2:$B$223,1,FALSE)","v":"Zamora"}]
["Vitoria-Gasteiz","Soria","Vitoria-Gasteiz-hasta-Soria",195,{"$f":"VLOOKUP(A2235,Municipios!$B$2:$B$223,1,FALSE)","v":"Vitoria-Gasteiz"}]
["Toledo","Soria","Toledo-hasta-Soria",298,{"$f":"VLOOKUP(A2236,Municipios!$B$2:$B$223,1,FALSE)","v":"Toledo"}]
["Teruel","Soria","Teruel-hasta-Soria",222,{"$f":"VLOOKUP(A2237,Municipios!$B$2:$B$223,1,FALSE)","v":"Teruel"}]
["Tarragona","Soria","Tarragona-hasta-Soria",430,{"$f":"VLOOKUP(A2238,Municipios!$B$2:$B$223,1,FALSE)","v":"Tarragona"}]
["Valencia","Soria",{"$f":"CONCATENATE(A2239,\"-hasta-\",B2239)","v":"Valencia-hasta-Soria"},420,{"$f":"VLOOKUP(A2239,Municipios!$B$2:$B$223,1,FALSE)","v":"Valencia"}]
["Zaragoza","Soria","Zaragoza-hasta-Soria",158,{"$f":"VLOOKUP(A2240,Municipios!$B$2:$B$223,1,FALSE)","v":"Zaragoza"}]
["Zaragoza","Ávila","Zaragoza-hasta-Ávila",434,{"$f":"VLOOKUP(A2241,Municipios!$B$2:$B$223,1,FALSE)","v":"Zaragoza"}]
["Pontevedra","Ávila","Pontevedra-hasta-Ávila",529,{"$f":"VLOOKUP(A2242,Municipios!$B$2:$B$223,1,FALSE)","v":"Pontevedra"}]
["Soria","Ávila","Soria-hasta-Ávila",252,{"$f":"VLOOKUP(A2243,Municipios!$B$2:$B$223,1,FALSE)","v":"Soria"}]
["Salamanca","Ávila","Salamanca-hasta-Ávila",94,{"$f":"VLOOKUP(A2244,Municipios!$B$2:$B$223,1,FALSE)","v":"Salamanca"}]
["Tarragona","Ávila","Tarragona-hasta-Ávila",690,{"$f":"VLOOKUP(A2245,Municipios!$B$2:$B$223,1,FALSE)","v":"Tarragona"}]
["Donostia-San Sebastián","Ávila","Donostia-San Sebastián-hasta-Ávila",507,{"$f":"VLOOKUP(A2246,Municipios!$B$2:$B$223,1,FALSE)","v":"Donostia-San Sebastián"}]
["Santander","Ávila","Santander-hasta-Ávila",378,{"$f":"VLOOKUP(A2247,Municipios!$B$2:$B$223,1,FALSE)","v":"Santander"}]
["Segovia","Ávila","Segovia-hasta-Ávila",66,{"$f":"VLOOKUP(A2248,Municipios!$B$2:$B$223,1,FALSE)","v":"Segovia"}]
["Cáceres","Ávila","Cáceres-hasta-Ávila",234,{"$f":"VLOOKUP(A2249,Municipios!$B$2:$B$223,1,FALSE)","v":"Cáceres"}]
["Burgos","Ávila","Burgos-hasta-Ávila",282,{"$f":"VLOOKUP(A2250,Municipios!$B$2:$B$223,1,FALSE)","v":"Burgos"}]
["Bilbao","Ávila","Bilbao-hasta-Ávila",426,{"$f":"VLOOKUP(A2251,Municipios!$B$2:$B$223,1,FALSE)","v":"Bilbao"}]
["Badajoz","Ávila","Badajoz-hasta-Ávila",386,{"$f":"VLOOKUP(A2252,Municipios!$B$2:$B$223,1,FALSE)","v":"Badajoz"}]
["Zamora","Ávila","Zamora-hasta-Ávila",159,{"$f":"VLOOKUP(A2253,Municipios!$B$2:$B$223,1,FALSE)","v":"Zamora"}]
["Vitoria-Gasteiz","Ávila","Vitoria-Gasteiz-hasta-Ávila",390,{"$f":"VLOOKUP(A2254,Municipios!$B$2:$B$223,1,FALSE)","v":"Vitoria-Gasteiz"}]
["Valladolid","Ávila","Valladolid-hasta-Ávila",160,{"$f":"VLOOKUP(A2255,Municipios!$B$2:$B$223,1,FALSE)","v":"Valladolid"}]
["Valencia","Ávila","Valencia-hasta-Ávila",485,{"$f":"VLOOKUP(A2256,Municipios!$B$2:$B$223,1,FALSE)","v":"Valencia"}]
["Toledo","Ávila","Toledo-hasta-Ávila",133,{"$f":"VLOOKUP(A2257,Municipios!$B$2:$B$223,1,FALSE)","v":"Toledo"}]
["Teruel","Ávila","Teruel-hasta-Ávila",414,{"$f":"VLOOKUP(A2258,Municipios!$B$2:$B$223,1,FALSE)","v":"Teruel"}]
["Pamplona/Iruña","Ávila","Pamplona/Iruña-hasta-Ávila",480,{"$f":"VLOOKUP(A2259,Municipios!$B$2:$B$223,1,FALSE)","v":"Pamplona/Iruña"}]
["Málaga","Ávila","Málaga-hasta-Ávila",673,{"$f":"VLOOKUP(A2260,Municipios!$B$2:$B$223,1,FALSE)","v":"Málaga"}]
["Barcelona","Ávila","Barcelona-hasta-Ávila",734,{"$f":"VLOOKUP(A2261,Municipios!$B$2:$B$223,1,FALSE)","v":"Barcelona"}]
["Castellón de la Plana/Castelló de la Plana","Ávila","Castellón de la Plana/Castelló de la Plana-hasta-Ávila",557,{"$f":"VLOOKUP(A2262,Municipios!$B$2:$B$223,1,FALSE)","v":"Castellón de la Plana/Castelló de la Plana"}]
["Jaén","Ávila","Jaén-hasta-Ávila",450,{"$f":"VLOOKUP(A2263,Municipios!$B$2:$B$223,1,FALSE)","v":"Jaén"}]
["Huelva","Ávila","Huelva-hasta-Ávila",596,{"$f":"VLOOKUP(A2264,Municipios!$B$2:$B$223,1,FALSE)","v":"Huelva"}]
["Ourense","Ávila","Ourense-hasta-Ávila",441,{"$f":"VLOOKUP(A2265,Municipios!$B$2:$B$223,1,FALSE)","v":"Ourense"}]
["Guadalajara","Ávila","Guadalajara-hasta-Ávila",174,{"$f":"VLOOKUP(A2266,Municipios!$B$2:$B$223,1,FALSE)","v":"Guadalajara"}]
["Palencia","Ávila","Palencia-hasta-Ávila",184,{"$f":"VLOOKUP(A2267,Municipios!$B$2:$B$223,1,FALSE)","v":"Palencia"}]
["Granada","Ávila","Granada-hasta-Ávila",541,{"$f":"VLOOKUP(A2268,Municipios!$B$2:$B$223,1,FALSE)","v":"Granada"}]
["Girona","Ávila","Girona-hasta-Ávila",816,{"$f":"VLOOKUP(A2269,Municipios!$B$2:$B$223,1,FALSE)","v":"Girona"}]
["Cuenca","Ávila","Cuenca-hasta-Ávila",300,{"$f":"VLOOKUP(A2270,Municipios!$B$2:$B$223,1,FALSE)","v":"Cuenca"}]
["Coruña (A)","Ávila","Coruña (A)-hasta-Ávila",540,{"$f":"VLOOKUP(A2271,Municipios!$B$2:$B$223,1,FALSE)","v":"Coruña (A)"}]
["Huesca","Ávila","Huesca-hasta-Ávila",505,{"$f":"VLOOKUP(A2272,Municipios!$B$2:$B$223,1,FALSE)","v":"Huesca"}]
["Ciudad Real","Ávila","Ciudad Real-hasta-Ávila",305,{"$f":"VLOOKUP(A2273,Municipios!$B$2:$B$223,1,FALSE)","v":"Ciudad Real"}]
["Cádiz","Ávila","Cádiz-hasta-Ávila",633,{"$f":"VLOOKUP(A2274,Municipios!$B$2:$B$223,1,FALSE)","v":"Cádiz"}]
["Lugo","Ávila","Lugo-hasta-Ávila",451,{"$f":"VLOOKUP(A2275,Municipios!$B$2:$B$223,1,FALSE)","v":"Lugo"}]
["León","Ávila","León-hasta-Ávila",282,{"$f":"VLOOKUP(A2276,Municipios!$B$2:$B$223,1,FALSE)","v":"León"}]
["Lleida","Ávila","Lleida-hasta-Ávila",595,{"$f":"VLOOKUP(A2277,Municipios!$B$2:$B$223,1,FALSE)","v":"Lleida"}]
["Madrid","Ávila","Madrid-hasta-Ávila",110,{"$f":"VLOOKUP(A2278,Municipios!$B$2:$B$223,1,FALSE)","v":"Madrid"}]
["Logroño","Ávila","Logroño-hasta-Ávila",425,{"$f":"VLOOKUP(A2279,Municipios!$B$2:$B$223,1,FALSE)","v":"Logroño"}]
["Murcia","Ávila","Murcia-hasta-Ávila",526,{"$f":"VLOOKUP(A2280,Municipios!$B$2:$B$223,1,FALSE)","v":"Murcia"}]
["Sevilla","Ávila","Sevilla-hasta-Ávila",514,{"$f":"VLOOKUP(A2281,Municipios!$B$2:$B$223,1,FALSE)","v":"Sevilla"}]
["Oviedo","Ávila","Oviedo-hasta-Ávila",383,{"$f":"VLOOKUP(A2282,Municipios!$B$2:$B$223,1,FALSE)","v":"Oviedo"}]
["Córdoba","Ávila","Córdoba-hasta-Ávila",514,{"$f":"VLOOKUP(A2283,Municipios!$B$2:$B$223,1,FALSE)","v":"Córdoba"}]
["Valladolid","Tarragona","Valladolid-hasta-Tarragona",740,{"$f":"VLOOKUP(A2284,Municipios!$B$2:$B$223,1,FALSE)","v":"Valladolid"}]
["Teruel","Tarragona","Teruel-hasta-Tarragona",299,{"$f":"VLOOKUP(A2285,Municipios!$B$2:$B$223,1,FALSE)","v":"Teruel"}]
["Valencia","Tarragona","Valencia-hasta-Tarragona",266,{"$f":"VLOOKUP(A2286,Municipios!$B$2:$B$223,1,FALSE)","v":"Valencia"}]
["Vitoria-Gasteiz","Tarragona","Vitoria-Gasteiz-hasta-Tarragona",531,{"$f":"VLOOKUP(A2287,Municipios!$B$2:$B$223,1,FALSE)","v":"Vitoria-Gasteiz"}]
["Zamora","Tarragona","Zamora-hasta-Tarragona",732,{"$f":"VLOOKUP(A2288,Municipios!$B$2:$B$223,1,FALSE)","v":"Zamora"}]
["Zaragoza","Tarragona","Zaragoza-hasta-Tarragona",273,{"$f":"VLOOKUP(A2289,Municipios!$B$2:$B$223,1,FALSE)","v":"Zaragoza"}]
["Toledo","Tarragona","Toledo-hasta-Tarragona",652,{"$f":"VLOOKUP(A2290,Municipios!$B$2:$B$223,1,FALSE)","v":"Toledo"}]
["Toledo","Teruel","Toledo-hasta-Teruel",327,{"$f":"VLOOKUP(A2291,Municipios!$B$2:$B$223,1,FALSE)","v":"Toledo"}]
["Valencia","Teruel","Valencia-hasta-Teruel",198,{"$f":"VLOOKUP(A2292,Municipios!$B$2:$B$223,1,FALSE)","v":"Valencia"}]
["Valladolid","Teruel","Valladolid-hasta-Teruel",436,{"$f":"VLOOKUP(A2293,Municipios!$B$2:$B$223,1,FALSE)","v":"Valladolid"}]
["Vitoria-Gasteiz","Teruel","Vitoria-Gasteiz-hasta-Teruel",441,{"$f":"VLOOKUP(A2294,Municipios!$B$2:$B$223,1,FALSE)","v":"Vitoria-Gasteiz"}]
["Zamora","Teruel","Zamora-hasta-Teruel",534,{"$f":"VLOOKUP(A2295,Municipios!$B$2:$B$223,1,FALSE)","v":"Zamora"}]
["Zaragoza","Teruel","Zaragoza-hasta-Teruel",181,{"$f":"VLOOKUP(A2296,Municipios!$B$2:$B$223,1,FALSE)","v":"Zaragoza"}]
["Zaragoza","Toledo","Zaragoza-hasta-Toledo",387,{"$f":"VLOOKUP(A2297,Municipios!$B$2:$B$223,1,FALSE)","v":"Zaragoza"}]
["Valencia","Toledo","Valencia-hasta-Toledo",361,{"$f":"VLOOKUP(A2298,Municipios!$B$2:$B$223,1,FALSE)","v":"Valencia"}]
["Valladolid","Toledo","Valladolid-hasta-Toledo",287,{"$f":"VLOOKUP(A2299,Municipios!$B$2:$B$223,1,FALSE)","v":"Valladolid"}]
["Vitoria-Gasteiz","Toledo","Vitoria-Gasteiz-hasta-Toledo",421,{"$f":"VLOOKUP(A2300,Municipios!$B$2:$B$223,1,FALSE)","v":"Vitoria-Gasteiz"}]
["Zamora","Toledo","Zamora-hasta-Toledo",328,{"$f":"VLOOKUP(A2301,Municipios!$B$2:$B$223,1,FALSE)","v":"Zamora"}]
["Vitoria-Gasteiz","Valencia","Vitoria-Gasteiz-hasta-Valencia",640,{"$f":"VLOOKUP(A2302,Municipios!$B$2:$B$223,1,FALSE)","v":"Vitoria-Gasteiz"}]
["Zamora","Valencia",{"$f":"CONCATENATE(A2303,\"-hasta-\",B2303)","v":"Zamora-hasta-Valencia"},624,{"$f":"VLOOKUP(A2303,Municipios!$B$2:$B$223,1,FALSE)","v":"Zamora"}]
["Zaragoza","Valencia","Zaragoza-hasta-Valencia",380,{"$f":"VLOOKUP(A2304,Municipios!$B$2:$B$223,1,FALSE)","v":"Zaragoza"}]
["Valladolid","Valencia","Valladolid-hasta-Valencia",585,{"$f":"VLOOKUP(A2305,Municipios!$B$2:$B$223,1,FALSE)","v":"Valladolid"}]
["Vitoria-Gasteiz","Valladolid","Vitoria-Gasteiz-hasta-Valladolid",229,{"$f":"VLOOKUP(A2306,Municipios!$B$2:$B$223,1,FALSE)","v":"Vitoria-Gasteiz"}]
["Zamora","Valladolid","Zamora-hasta-Valladolid",89,{"$f":"VLOOKUP(A2307,Municipios!$B$2:$B$223,1,FALSE)","v":"Zamora"}]
["Zaragoza","Valladolid","Zaragoza-hasta-Valladolid",435,{"$f":"VLOOKUP(A2308,Municipios!$B$2:$B$223,1,FALSE)","v":"Zaragoza"}]
["Zamora","Vitoria/Gasteiz","Zamora-hasta-Vitoria/Gasteiz",319,{"$f":"VLOOKUP(A2309,Municipios!$B$2:$B$223,1,FALSE)","v":"Zamora"}]
["Zaragoza","Vitoria/Gasteiz","Zaragoza-hasta-Vitoria/Gasteiz",260,{"$f":"VLOOKUP(A2310,Municipios!$B$2:$B$223,1,FALSE)","v":"Zaragoza"}]
["Zaragoza","Zamora","Zaragoza-hasta-Zamora",460,{"$f":"VLOOKUP(A2311,Municipios!$B$2:$B$223,1,FALSE)","v":"Zaragoza"}]
["Madrid","Badajoz","Madrid-hasta-Badajoz",407,{"$f":"VLOOKUP(A2312,Municipios!$B$2:$B$223,1,FALSE)","v":"Madrid"}]
["Valencia","Badajoz","Valencia-hasta-Badajoz",713,{"$f":"VLOOKUP(A2313,Municipios!$B$2:$B$223,1,FALSE)","v":"Valencia"}]
["Lugo","Badajoz","Lugo-hasta-Badajoz",705,{"$f":"VLOOKUP(A2314,Municipios!$B$2:$B$223,1,FALSE)","v":"Lugo"}]
["Donostia-San Sebastián","Badajoz","Donostia-San Sebastián-hasta-Badajoz",818,{"$f":"VLOOKUP(A2315,Municipios!$B$2:$B$223,1,FALSE)","v":"Donostia-San Sebastián"}]
["Santander","Badajoz","Santander-hasta-Badajoz",706,{"$f":"VLOOKUP(A2316,Municipios!$B$2:$B$223,1,FALSE)","v":"Santander"}]
["Segovia","Badajoz","Segovia-hasta-Badajoz",457,{"$f":"VLOOKUP(A2317,Municipios!$B$2:$B$223,1,FALSE)","v":"Segovia"}]
["Sevilla","Badajoz","Sevilla-hasta-Badajoz",261,{"$f":"VLOOKUP(A2318,Municipios!$B$2:$B$223,1,FALSE)","v":"Sevilla"}]
["Soria","Badajoz","Soria-hasta-Badajoz",637,{"$f":"VLOOKUP(A2319,Municipios!$B$2:$B$223,1,FALSE)","v":"Soria"}]
["Tarragona","Badajoz","Tarragona-hasta-Badajoz",1017,{"$f":"VLOOKUP(A2320,Municipios!$B$2:$B$223,1,FALSE)","v":"Tarragona"}]
["Pontevedra","Badajoz","Pontevedra-hasta-Badajoz",791,{"$f":"VLOOKUP(A2321,Municipios!$B$2:$B$223,1,FALSE)","v":"Pontevedra"}]
["Toledo","Badajoz","Toledo-hasta-Badajoz",375,{"$f":"VLOOKUP(A2322,Municipios!$B$2:$B$223,1,FALSE)","v":"Toledo"}]
["Pamplona/Iruña","Badajoz","Pamplona/Iruña-hasta-Badajoz",791,{"$f":"VLOOKUP(A2323,Municipios!$B$2:$B$223,1,FALSE)","v":"Pamplona/Iruña"}]
["Valladolid","Badajoz","Valladolid-hasta-Badajoz",465,{"$f":"VLOOKUP(A2324,Municipios!$B$2:$B$223,1,FALSE)","v":"Valladolid"}]
["Vitoria-Gasteiz","Badajoz","Vitoria-Gasteiz-hasta-Badajoz",701,{"$f":"VLOOKUP(A2325,Municipios!$B$2:$B$223,1,FALSE)","v":"Vitoria-Gasteiz"}]
["Zamora","Badajoz","Zamora-hasta-Badajoz",410,{"$f":"VLOOKUP(A2326,Municipios!$B$2:$B$223,1,FALSE)","v":"Zamora"}]
["Zaragoza","Badajoz","Zaragoza-hasta-Badajoz",705,{"$f":"VLOOKUP(A2327,Municipios!$B$2:$B$223,1,FALSE)","v":"Zaragoza"}]
["Barcelona","Badajoz","Barcelona-hasta-Badajoz",1030,{"$f":"VLOOKUP(A2328,Municipios!$B$2:$B$223,1,FALSE)","v":"Barcelona"}]
["Bilbao","Badajoz","Bilbao-hasta-Badajoz",737,{"$f":"VLOOKUP(A2329,Municipios!$B$2:$B$223,1,FALSE)","v":"Bilbao"}]
["Burgos","Badajoz","Burgos-hasta-Badajoz",593,{"$f":"VLOOKUP(A2330,Municipios!$B$2:$B$223,1,FALSE)","v":"Burgos"}]
["Cáceres","Badajoz","Cáceres-hasta-Badajoz",133,{"$f":"VLOOKUP(A2331,Municipios!$B$2:$B$223,1,FALSE)","v":"Cáceres"}]
["Teruel","Badajoz","Teruel-hasta-Badajoz",709,{"$f":"VLOOKUP(A2332,Municipios!$B$2:$B$223,1,FALSE)","v":"Teruel"}]
["Huesca","Badajoz","Huesca-hasta-Badajoz",800,{"$f":"VLOOKUP(A2333,Municipios!$B$2:$B$223,1,FALSE)","v":"Huesca"}]
["Castellón de la Plana/Castelló de la Plana","Badajoz","Castellón de la Plana/Castelló de la Plana-hasta-Badajoz",780,{"$f":"VLOOKUP(A2334,Municipios!$B$2:$B$223,1,FALSE)","v":"Castellón de la Plana/Castelló de la Plana"}]
["Ciudad Real","Badajoz","Ciudad Real-hasta-Badajoz",311,{"$f":"VLOOKUP(A2335,Municipios!$B$2:$B$223,1,FALSE)","v":"Ciudad Real"}]
["Córdoba","Badajoz","Córdoba-hasta-Badajoz",276,{"$f":"VLOOKUP(A2336,Municipios!$B$2:$B$223,1,FALSE)","v":"Córdoba"}]
["Coruña (A)","Badajoz","Coruña (A)-hasta-Badajoz",796,{"$f":"VLOOKUP(A2337,Municipios!$B$2:$B$223,1,FALSE)","v":"Coruña (A)"}]
["Cuenca","Badajoz","Cuenca-hasta-Badajoz",535,{"$f":"VLOOKUP(A2338,Municipios!$B$2:$B$223,1,FALSE)","v":"Cuenca"}]
["Girona","Badajoz","Girona-hasta-Badajoz",1111,{"$f":"VLOOKUP(A2339,Municipios!$B$2:$B$223,1,FALSE)","v":"Girona"}]
["Granada","Badajoz","Granada-hasta-Badajoz",435,{"$f":"VLOOKUP(A2340,Municipios!$B$2:$B$223,1,FALSE)","v":"Granada"}]
["Salamanca","Badajoz","Salamanca-hasta-Badajoz",345,{"$f":"VLOOKUP(A2341,Municipios!$B$2:$B$223,1,FALSE)","v":"Salamanca"}]
["Huelva","Badajoz","Huelva-hasta-Badajoz",346,{"$f":"VLOOKUP(A2342,Municipios!$B$2:$B$223,1,FALSE)","v":"Huelva"}]
["Cádiz","Badajoz","Cádiz-hasta-Badajoz",380,{"$f":"VLOOKUP(A2343,Municipios!$B$2:$B$223,1,FALSE)","v":"Cádiz"}]
["Jaén","Badajoz","Jaén-hasta-Badajoz",416,{"$f":"VLOOKUP(A2344,Municipios!$B$2:$B$223,1,FALSE)","v":"Jaén"}]
["León","Badajoz","León-hasta-Badajoz",546,{"$f":"VLOOKUP(A2345,Municipios!$B$2:$B$223,1,FALSE)","v":"León"}]
["Logroño","Badajoz","Logroño-hasta-Badajoz",612,{"$f":"VLOOKUP(A2346,Municipios!$B$2:$B$223,1,FALSE)","v":"Logroño"}]
["Lleida","Badajoz","Lleida-hasta-Badajoz",891,{"$f":"VLOOKUP(A2347,Municipios!$B$2:$B$223,1,FALSE)","v":"Lleida"}]
["Málaga","Badajoz","Málaga-hasta-Badajoz",461,{"$f":"VLOOKUP(A2348,Municipios!$B$2:$B$223,1,FALSE)","v":"Málaga"}]
["Murcia","Badajoz","Murcia-hasta-Badajoz",661,{"$f":"VLOOKUP(A2349,Municipios!$B$2:$B$223,1,FALSE)","v":"Murcia"}]
["Ourense","Badajoz","Ourense-hasta-Badajoz",703,{"$f":"VLOOKUP(A2350,Municipios!$B$2:$B$223,1,FALSE)","v":"Ourense"}]
["Oviedo","Badajoz","Oviedo-hasta-Badajoz",664,{"$f":"VLOOKUP(A2351,Municipios!$B$2:$B$223,1,FALSE)","v":"Oviedo"}]
["Palencia","Badajoz","Palencia-hasta-Badajoz",507,{"$f":"VLOOKUP(A2352,Municipios!$B$2:$B$223,1,FALSE)","v":"Palencia"}]
["Guadalajara","Badajoz","Guadalajara-hasta-Badajoz",470,{"$f":"VLOOKUP(A2353,Municipios!$B$2:$B$223,1,FALSE)","v":"Guadalajara"}]
["Huelva","Barcelona","Huelva-hasta-Barcelona",1127,{"$f":"VLOOKUP(A2354,Municipios!$B$2:$B$223,1,FALSE)","v":"Huelva"}]
["Cuenca","Barcelona","Cuenca-hasta-Barcelona",552,{"$f":"VLOOKUP(A2355,Municipios!$B$2:$B$223,1,FALSE)","v":"Cuenca"}]
["Sevilla","Barcelona","Sevilla-hasta-Barcelona",1036,{"$f":"VLOOKUP(A2356,Municipios!$B$2:$B$223,1,FALSE)","v":"Sevilla"}]
["Soria","Barcelona","Soria-hasta-Barcelona",466,{"$f":"VLOOKUP(A2357,Municipios!$B$2:$B$223,1,FALSE)","v":"Soria"}]
["Teruel","Barcelona","Teruel-hasta-Barcelona",404,{"$f":"VLOOKUP(A2358,Municipios!$B$2:$B$223,1,FALSE)","v":"Teruel"}]
["Toledo","Barcelona","Toledo-hasta-Barcelona",690,{"$f":"VLOOKUP(A2359,Municipios!$B$2:$B$223,1,FALSE)","v":"Toledo"}]
["Valencia","Barcelona","Valencia-hasta-Barcelona",353,{"$f":"VLOOKUP(A2360,Municipios!$B$2:$B$223,1,FALSE)","v":"Valencia"}]
["Valladolid","Barcelona","Valladolid-hasta-Barcelona",739,{"$f":"VLOOKUP(A2361,Municipios!$B$2:$B$223,1,FALSE)","v":"Valladolid"}]
["Zaragoza","Barcelona","Zaragoza-hasta-Barcelona",286,{"$f":"VLOOKUP(A2362,Municipios!$B$2:$B$223,1,FALSE)","v":"Zaragoza"}]
["Segovia","Barcelona","Segovia-hasta-Barcelona",651,{"$f":"VLOOKUP(A2363,Municipios!$B$2:$B$223,1,FALSE)","v":"Segovia"}]
["Cáceres","Barcelona","Cáceres-hasta-Barcelona",919,{"$f":"VLOOKUP(A2364,Municipios!$B$2:$B$223,1,FALSE)","v":"Cáceres"}]
["Zamora","Barcelona","Zamora-hasta-Barcelona",770,{"$f":"VLOOKUP(A2365,Municipios!$B$2:$B$223,1,FALSE)","v":"Zamora"}]
["Granada","Barcelona","Granada-hasta-Barcelona",932,{"$f":"VLOOKUP(A2366,Municipios!$B$2:$B$223,1,FALSE)","v":"Granada"}]
["Huesca","Barcelona",{"$f":"CONCATENATE(A2367,\"-hasta-\",B2367)","v":"Huesca-hasta-Barcelona"},262,{"$f":"VLOOKUP(A2367,Municipios!$B$2:$B$223,1,FALSE)","v":"Huesca"}]
["Cádiz","Barcelona","Cádiz-hasta-Barcelona",1148,{"$f":"VLOOKUP(A2368,Municipios!$B$2:$B$223,1,FALSE)","v":"Cádiz"}]
["Lleida","Barcelona","Lleida-hasta-Barcelona",171,{"$f":"VLOOKUP(A2369,Municipios!$B$2:$B$223,1,FALSE)","v":"Lleida"}]
["Oviedo","Barcelona","Oviedo-hasta-Barcelona",922,{"$f":"VLOOKUP(A2370,Municipios!$B$2:$B$223,1,FALSE)","v":"Oviedo"}]
["Donostia-San Sebastián","Barcelona","Donostia-San Sebastián-hasta-Barcelona",551,{"$f":"VLOOKUP(A2371,Municipios!$B$2:$B$223,1,FALSE)","v":"Donostia-San Sebastián"}]
["Tarragona","Barcelona","Tarragona-hasta-Barcelona",93,{"$f":"VLOOKUP(A2372,Municipios!$B$2:$B$223,1,FALSE)","v":"Tarragona"}]
["Vitoria-Gasteiz","Barcelona","Vitoria-Gasteiz-hasta-Barcelona",546,{"$f":"VLOOKUP(A2373,Municipios!$B$2:$B$223,1,FALSE)","v":"Vitoria-Gasteiz"}]
["Burgos","Barcelona","Burgos-hasta-Barcelona",610,{"$f":"VLOOKUP(A2374,Municipios!$B$2:$B$223,1,FALSE)","v":"Burgos"}]
["Coruña (A)","Barcelona","Coruña (A)-hasta-Barcelona",1116,{"$f":"VLOOKUP(A2375,Municipios!$B$2:$B$223,1,FALSE)","v":"Coruña (A)"}]
["Castellón de la Plana/Castelló de la Plana","Barcelona","Castellón de la Plana/Castelló de la Plana-hasta-Barcelona",271,{"$f":"VLOOKUP(A2376,Municipios!$B$2:$B$223,1,FALSE)","v":"Castellón de la Plana/Castelló de la Plana"}]
["Bilbao","Barcelona","Bilbao-hasta-Barcelona",589,{"$f":"VLOOKUP(A2377,Municipios!$B$2:$B$223,1,FALSE)","v":"Bilbao"}]
["Córdoba","Barcelona","Córdoba-hasta-Barcelona",898,{"$f":"VLOOKUP(A2378,Municipios!$B$2:$B$223,1,FALSE)","v":"Córdoba"}]
["Santander","Barcelona","Santander-hasta-Barcelona",768,{"$f":"VLOOKUP(A2379,Municipios!$B$2:$B$223,1,FALSE)","v":"Santander"}]
["Girona","Barcelona","Girona-hasta-Barcelona",86,{"$f":"VLOOKUP(A2380,Municipios!$B$2:$B$223,1,FALSE)","v":"Girona"}]
["Guadalajara","Barcelona","Guadalajara-hasta-Barcelona",560,{"$f":"VLOOKUP(A2381,Municipios!$B$2:$B$223,1,FALSE)","v":"Guadalajara"}]
["Jaén","Barcelona","Jaén-hasta-Barcelona",834,{"$f":"VLOOKUP(A2382,Municipios!$B$2:$B$223,1,FALSE)","v":"Jaén"}]
["León","Barcelona","León-hasta-Barcelona",804,{"$f":"VLOOKUP(A2383,Municipios!$B$2:$B$223,1,FALSE)","v":"León"}]
["Logroño","Barcelona","Logroño-hasta-Barcelona",471,{"$f":"VLOOKUP(A2384,Municipios!$B$2:$B$223,1,FALSE)","v":"Logroño"}]
["Lugo","Barcelona","Lugo-hasta-Barcelona",1025,{"$f":"VLOOKUP(A2385,Municipios!$B$2:$B$223,1,FALSE)","v":"Lugo"}]
["Pamplona/Iruña","Barcelona","Pamplona/Iruña-hasta-Barcelona",461,{"$f":"VLOOKUP(A2386,Municipios!$B$2:$B$223,1,FALSE)","v":"Pamplona/Iruña"}]
["Ciudad Real","Barcelona","Ciudad Real-hasta-Barcelona",754,{"$f":"VLOOKUP(A2387,Municipios!$B$2:$B$223,1,FALSE)","v":"Ciudad Real"}]
["Madrid","Barcelona","Madrid-hasta-Barcelona",612,{"$f":"VLOOKUP(A2388,Municipios!$B$2:$B$223,1,FALSE)","v":"Madrid"}]
["Pontevedra","Barcelona","Pontevedra-hasta-Barcelona",1047,{"$f":"VLOOKUP(A2389,Municipios!$B$2:$B$223,1,FALSE)","v":"Pontevedra"}]
["Palencia","Barcelona","Palencia-hasta-Barcelona",710,{"$f":"VLOOKUP(A2390,Municipios!$B$2:$B$223,1,FALSE)","v":"Palencia"}]
["Ourense","Barcelona","Ourense-hasta-Barcelona",953,{"$f":"VLOOKUP(A2391,Municipios!$B$2:$B$223,1,FALSE)","v":"Ourense"}]
["Murcia","Barcelona","Murcia-hasta-Barcelona",615,{"$f":"VLOOKUP(A2392,Municipios!$B$2:$B$223,1,FALSE)","v":"Murcia"}]
["Málaga","Barcelona","Málaga-hasta-Barcelona",1057,{"$f":"VLOOKUP(A2393,Municipios!$B$2:$B$223,1,FALSE)","v":"Málaga"}]
["Salamanca","Barcelona","Salamanca-hasta-Barcelona",828,{"$f":"VLOOKUP(A2394,Municipios!$B$2:$B$223,1,FALSE)","v":"Salamanca"}]
["Burgos","Bilbao","Burgos-hasta-Bilbao",145,{"$f":"VLOOKUP(A2395,Municipios!$B$2:$B$223,1,FALSE)","v":"Burgos"}]
["Segovia","Bilbao","Segovia-hasta-Bilbao",339,{"$f":"VLOOKUP(A2396,Municipios!$B$2:$B$223,1,FALSE)","v":"Segovia"}]
["Toledo","Bilbao","Toledo-hasta-Bilbao",457,{"$f":"VLOOKUP(A2397,Municipios!$B$2:$B$223,1,FALSE)","v":"Toledo"}]
["Sevilla","Bilbao","Sevilla-hasta-Bilbao",916,{"$f":"VLOOKUP(A2398,Municipios!$B$2:$B$223,1,FALSE)","v":"Sevilla"}]
["Soria","Bilbao","Soria-hasta-Bilbao",233,{"$f":"VLOOKUP(A2399,Municipios!$B$2:$B$223,1,FALSE)","v":"Soria"}]
["Santander","Bilbao","Santander-hasta-Bilbao",100,{"$f":"VLOOKUP(A2400,Municipios!$B$2:$B$223,1,FALSE)","v":"Santander"}]
["Tarragona","Bilbao","Tarragona-hasta-Bilbao",565,{"$f":"VLOOKUP(A2401,Municipios!$B$2:$B$223,1,FALSE)","v":"Tarragona"}]
["Teruel","Bilbao","Teruel-hasta-Bilbao",479,{"$f":"VLOOKUP(A2402,Municipios!$B$2:$B$223,1,FALSE)","v":"Teruel"}]
["Valencia","Bilbao","Valencia-hasta-Bilbao",678,{"$f":"VLOOKUP(A2403,Municipios!$B$2:$B$223,1,FALSE)","v":"Valencia"}]
["Valladolid","Bilbao","Valladolid-hasta-Bilbao",271,{"$f":"VLOOKUP(A2404,Municipios!$B$2:$B$223,1,FALSE)","v":"Valladolid"}]
["Vitoria-Gasteiz","Bilbao","Vitoria-Gasteiz-hasta-Bilbao",67,{"$f":"VLOOKUP(A2405,Municipios!$B$2:$B$223,1,FALSE)","v":"Vitoria-Gasteiz"}]
["Zaragoza","Bilbao","Zaragoza-hasta-Bilbao",298,{"$f":"VLOOKUP(A2406,Municipios!$B$2:$B$223,1,FALSE)","v":"Zaragoza"}]
["Cáceres","Bilbao","Cáceres-hasta-Bilbao",609,{"$f":"VLOOKUP(A2407,Municipios!$B$2:$B$223,1,FALSE)","v":"Cáceres"}]
["Lleida","Bilbao","Lleida-hasta-Bilbao",459,{"$f":"VLOOKUP(A2408,Municipios!$B$2:$B$223,1,FALSE)","v":"Lleida"}]
["Donostia-San Sebastián","Bilbao","Donostia-San Sebastián-hasta-Bilbao",105,{"$f":"VLOOKUP(A2409,Municipios!$B$2:$B$223,1,FALSE)","v":"Donostia-San Sebastián"}]
["Zamora","Bilbao","Zamora-hasta-Bilbao",373,{"$f":"VLOOKUP(A2410,Municipios!$B$2:$B$223,1,FALSE)","v":"Zamora"}]
["Cuenca","Bilbao","Cuenca-hasta-Bilbao",546,{"$f":"VLOOKUP(A2411,Municipios!$B$2:$B$223,1,FALSE)","v":"Cuenca"}]
["Cádiz","Bilbao","Cádiz-hasta-Bilbao",1029,{"$f":"VLOOKUP(A2412,Municipios!$B$2:$B$223,1,FALSE)","v":"Cádiz"}]
["Castellón de la Plana/Castelló de la Plana","Bilbao","Castellón de la Plana/Castelló de la Plana-hasta-Bilbao",743,{"$f":"VLOOKUP(A2413,Municipios!$B$2:$B$223,1,FALSE)","v":"Castellón de la Plana/Castelló de la Plana"}]
["Ciudad Real","Bilbao","Ciudad Real-hasta-Bilbao",572,{"$f":"VLOOKUP(A2414,Municipios!$B$2:$B$223,1,FALSE)","v":"Ciudad Real"}]
["Málaga","Bilbao","Málaga-hasta-Bilbao",920,{"$f":"VLOOKUP(A2415,Municipios!$B$2:$B$223,1,FALSE)","v":"Málaga"}]
["Coruña (A)","Bilbao","Coruña (A)-hasta-Bilbao",651,{"$f":"VLOOKUP(A2416,Municipios!$B$2:$B$223,1,FALSE)","v":"Coruña (A)"}]
["Salamanca","Bilbao","Salamanca-hasta-Bilbao",394,{"$f":"VLOOKUP(A2417,Municipios!$B$2:$B$223,1,FALSE)","v":"Salamanca"}]
["Girona","Bilbao","Girona-hasta-Bilbao",626,{"$f":"VLOOKUP(A2418,Municipios!$B$2:$B$223,1,FALSE)","v":"Girona"}]
["Granada","Bilbao","Granada-hasta-Bilbao",805,{"$f":"VLOOKUP(A2419,Municipios!$B$2:$B$223,1,FALSE)","v":"Granada"}]
["Guadalajara","Bilbao","Guadalajara-hasta-Bilbao",382,{"$f":"VLOOKUP(A2420,Municipios!$B$2:$B$223,1,FALSE)","v":"Guadalajara"}]
["Huelva","Bilbao","Huelva-hasta-Bilbao",1007,{"$f":"VLOOKUP(A2421,Municipios!$B$2:$B$223,1,FALSE)","v":"Huelva"}]
["Huesca","Bilbao","Huesca-hasta-Bilbao",369,{"$f":"VLOOKUP(A2422,Municipios!$B$2:$B$223,1,FALSE)","v":"Huesca"}]
["Jaén","Bilbao","Jaén-hasta-Bilbao",714,{"$f":"VLOOKUP(A2423,Municipios!$B$2:$B$223,1,FALSE)","v":"Jaén"}]
["Oviedo","Bilbao","Oviedo-hasta-Bilbao",293,{"$f":"VLOOKUP(A2424,Municipios!$B$2:$B$223,1,FALSE)","v":"Oviedo"}]
["Córdoba","Bilbao","Córdoba-hasta-Bilbao",778,{"$f":"VLOOKUP(A2425,Municipios!$B$2:$B$223,1,FALSE)","v":"Córdoba"}]
["León","Bilbao","León-hasta-Bilbao",339,{"$f":"VLOOKUP(A2426,Municipios!$B$2:$B$223,1,FALSE)","v":"León"}]
["Pontevedra","Bilbao","Pontevedra-hasta-Bilbao",581,{"$f":"VLOOKUP(A2427,Municipios!$B$2:$B$223,1,FALSE)","v":"Pontevedra"}]
["Palencia","Bilbao","Palencia-hasta-Bilbao",252,{"$f":"VLOOKUP(A2428,Municipios!$B$2:$B$223,1,FALSE)","v":"Palencia"}]
["Ourense","Bilbao","Ourense-hasta-Bilbao",488,{"$f":"VLOOKUP(A2429,Municipios!$B$2:$B$223,1,FALSE)","v":"Ourense"}]
["Murcia","Bilbao","Murcia-hasta-Bilbao",767,{"$f":"VLOOKUP(A2430,Municipios!$B$2:$B$223,1,FALSE)","v":"Murcia"}]
["Madrid","Bilbao",{"$f":"CONCATENATE(A2431,\"-hasta-\",B2431)","v":"Madrid-hasta-Bilbao"},370,{"$f":"VLOOKUP(A2431,Municipios!$B$2:$B$223,1,FALSE)","v":"Madrid"}]
["Lugo","Bilbao","Lugo-hasta-Bilbao",560,{"$f":"VLOOKUP(A2432,Municipios!$B$2:$B$223,1,FALSE)","v":"Lugo"}]
["Logroño","Bilbao","Logroño-hasta-Bilbao",127,{"$f":"VLOOKUP(A2433,Municipios!$B$2:$B$223,1,FALSE)","v":"Logroño"}]
["Pamplona/Iruña","Bilbao","Pamplona/Iruña-hasta-Bilbao",157,{"$f":"VLOOKUP(A2434,Municipios!$B$2:$B$223,1,FALSE)","v":"Pamplona/Iruña"}]
["Santander","Burgos","Santander-hasta-Burgos",152,{"$f":"VLOOKUP(A2435,Municipios!$B$2:$B$223,1,FALSE)","v":"Santander"}]
["Cáceres","Burgos","Cáceres-hasta-Burgos",545,{"$f":"VLOOKUP(A2436,Municipios!$B$2:$B$223,1,FALSE)","v":"Cáceres"}]
["Teruel","Burgos","Teruel-hasta-Burgos",370,{"$f":"VLOOKUP(A2437,Municipios!$B$2:$B$223,1,FALSE)","v":"Teruel"}]
["Donostia-San Sebastián","Burgos","Donostia-San Sebastián-hasta-Burgos",225,{"$f":"VLOOKUP(A2438,Municipios!$B$2:$B$223,1,FALSE)","v":"Donostia-San Sebastián"}]
["Segovia","Burgos","Segovia-hasta-Burgos",197,{"$f":"VLOOKUP(A2439,Municipios!$B$2:$B$223,1,FALSE)","v":"Segovia"}]
["Sevilla","Burgos","Sevilla-hasta-Burgos",771,{"$f":"VLOOKUP(A2440,Municipios!$B$2:$B$223,1,FALSE)","v":"Sevilla"}]
["Soria","Burgos","Soria-hasta-Burgos",147,{"$f":"VLOOKUP(A2441,Municipios!$B$2:$B$223,1,FALSE)","v":"Soria"}]
["Tarragona","Burgos","Tarragona-hasta-Burgos",572,{"$f":"VLOOKUP(A2442,Municipios!$B$2:$B$223,1,FALSE)","v":"Tarragona"}]
["Toledo","Burgos","Toledo-hasta-Burgos",313,{"$f":"VLOOKUP(A2443,Municipios!$B$2:$B$223,1,FALSE)","v":"Toledo"}]
["Valencia","Burgos","Valencia-hasta-Burgos",583,{"$f":"VLOOKUP(A2444,Municipios!$B$2:$B$223,1,FALSE)","v":"Valencia"}]
["Valladolid","Burgos","Valladolid-hasta-Burgos",121,{"$f":"VLOOKUP(A2445,Municipios!$B$2:$B$223,1,FALSE)","v":"Valladolid"}]
["Vitoria-Gasteiz","Burgos","Vitoria-Gasteiz-hasta-Burgos",108,{"$f":"VLOOKUP(A2446,Municipios!$B$2:$B$223,1,FALSE)","v":"Vitoria-Gasteiz"}]
["Zaragoza","Burgos","Zaragoza-hasta-Burgos",306,{"$f":"VLOOKUP(A2447,Municipios!$B$2:$B$223,1,FALSE)","v":"Zaragoza"}]
["Salamanca","Burgos","Salamanca-hasta-Burgos",242,{"$f":"VLOOKUP(A2448,Municipios!$B$2:$B$223,1,FALSE)","v":"Salamanca"}]
["Cuenca","Burgos","Cuenca-hasta-Burgos",379,{"$f":"VLOOKUP(A2449,Municipios!$B$2:$B$223,1,FALSE)","v":"Cuenca"}]
["Zamora","Burgos","Zamora-hasta-Burgos",211,{"$f":"VLOOKUP(A2450,Municipios!$B$2:$B$223,1,FALSE)","v":"Zamora"}]
["Córdoba","Burgos","Córdoba-hasta-Burgos",633,{"$f":"VLOOKUP(A2451,Municipios!$B$2:$B$223,1,FALSE)","v":"Córdoba"}]
["Granada","Burgos","Granada-hasta-Burgos",662,{"$f":"VLOOKUP(A2452,Municipios!$B$2:$B$223,1,FALSE)","v":"Granada"}]
["Pontevedra","Burgos","Pontevedra-hasta-Burgos",431,{"$f":"VLOOKUP(A2453,Municipios!$B$2:$B$223,1,FALSE)","v":"Pontevedra"}]
["Guadalajara","Burgos","Guadalajara-hasta-Burgos",238,{"$f":"VLOOKUP(A2454,Municipios!$B$2:$B$223,1,FALSE)","v":"Guadalajara"}]
["Coruña (A)","Burgos","Coruña (A)-hasta-Burgos",501,{"$f":"VLOOKUP(A2455,Municipios!$B$2:$B$223,1,FALSE)","v":"Coruña (A)"}]
["Ciudad Real","Burgos","Ciudad Real-hasta-Burgos",428,{"$f":"VLOOKUP(A2456,Municipios!$B$2:$B$223,1,FALSE)","v":"Ciudad Real"}]
["Castellón de la Plana/Castelló de la Plana","Burgos","Castellón de la Plana/Castelló de la Plana-hasta-Burgos",533,{"$f":"VLOOKUP(A2457,Municipios!$B$2:$B$223,1,FALSE)","v":"Castellón de la Plana/Castelló de la Plana"}]
["Cádiz","Burgos","Cádiz-hasta-Burgos",890,{"$f":"VLOOKUP(A2458,Municipios!$B$2:$B$223,1,FALSE)","v":"Cádiz"}]
["Huelva","Burgos","Huelva-hasta-Burgos",862,{"$f":"VLOOKUP(A2459,Municipios!$B$2:$B$223,1,FALSE)","v":"Huelva"}]
["Huesca","Burgos","Huesca-hasta-Burgos",381,{"$f":"VLOOKUP(A2460,Municipios!$B$2:$B$223,1,FALSE)","v":"Huesca"}]
["Jaén","Burgos","Jaén-hasta-Burgos",570,{"$f":"VLOOKUP(A2461,Municipios!$B$2:$B$223,1,FALSE)","v":"Jaén"}]
["Ourense","Burgos","Ourense-hasta-Burgos",337,{"$f":"VLOOKUP(A2462,Municipios!$B$2:$B$223,1,FALSE)","v":"Ourense"}]
["Pamplona/Iruña","Burgos","Pamplona/Iruña-hasta-Burgos",198,{"$f":"VLOOKUP(A2463,Municipios!$B$2:$B$223,1,FALSE)","v":"Pamplona/Iruña"}]
["Girona","Burgos","Girona-hasta-Burgos",687,{"$f":"VLOOKUP(A2464,Municipios!$B$2:$B$223,1,FALSE)","v":"Girona"}]
["León","Burgos","León-hasta-Burgos",188,{"$f":"VLOOKUP(A2465,Municipios!$B$2:$B$223,1,FALSE)","v":"León"}]
["Palencia","Burgos","Palencia-hasta-Burgos",100,{"$f":"VLOOKUP(A2466,Municipios!$B$2:$B$223,1,FALSE)","v":"Palencia"}]
["Oviedo","Burgos","Oviedo-hasta-Burgos",306,{"$f":"VLOOKUP(A2467,Municipios!$B$2:$B$223,1,FALSE)","v":"Oviedo"}]
["Murcia","Burgos","Murcia-hasta-Burgos",628,{"$f":"VLOOKUP(A2468,Municipios!$B$2:$B$223,1,FALSE)","v":"Murcia"}]
["Málaga","Burgos","Málaga-hasta-Burgos",793,{"$f":"VLOOKUP(A2469,Municipios!$B$2:$B$223,1,FALSE)","v":"Málaga"}]
["Madrid","Burgos","Madrid-hasta-Burgos",226,{"$f":"VLOOKUP(A2470,Municipios!$B$2:$B$223,1,FALSE)","v":"Madrid"}]
["Lleida","Burgos","Lleida-hasta-Burgos",484,{"$f":"VLOOKUP(A2471,Municipios!$B$2:$B$223,1,FALSE)","v":"Lleida"}]
["Lugo","Burgos","Lugo-hasta-Burgos",409,{"$f":"VLOOKUP(A2472,Municipios!$B$2:$B$223,1,FALSE)","v":"Lugo"}]
["Logroño","Burgos","Logroño-hasta-Burgos",135,{"$f":"VLOOKUP(A2473,Municipios!$B$2:$B$223,1,FALSE)","v":"Logroño"}]
["Donostia-San Sebastián","Cáceres","Donostia-San Sebastián-hasta-Cáceres",679,{"$f":"VLOOKUP(A2474,Municipios!$B$2:$B$223,1,FALSE)","v":"Donostia-San Sebastián"}]
["Zamora","Cáceres","Zamora-hasta-Cáceres",277,{"$f":"VLOOKUP(A2475,Municipios!$B$2:$B$223,1,FALSE)","v":"Zamora"}]
["Segovia","Cáceres","Segovia-hasta-Cáceres",300,{"$f":"VLOOKUP(A2476,Municipios!$B$2:$B$223,1,FALSE)","v":"Segovia"}]
["Sevilla","Cáceres","Sevilla-hasta-Cáceres",261,{"$f":"VLOOKUP(A2477,Municipios!$B$2:$B$223,1,FALSE)","v":"Sevilla"}]
["Soria","Cáceres","Soria-hasta-Cáceres",528,{"$f":"VLOOKUP(A2478,Municipios!$B$2:$B$223,1,FALSE)","v":"Soria"}]
["Tarragona","Cáceres","Tarragona-hasta-Cáceres",883,{"$f":"VLOOKUP(A2479,Municipios!$B$2:$B$223,1,FALSE)","v":"Tarragona"}]
["Santander","Cáceres","Santander-hasta-Cáceres",573,{"$f":"VLOOKUP(A2480,Municipios!$B$2:$B$223,1,FALSE)","v":"Santander"}]
["Teruel","Cáceres","Teruel-hasta-Cáceres",583,{"$f":"VLOOKUP(A2481,Municipios!$B$2:$B$223,1,FALSE)","v":"Teruel"}]
["Toledo","Cáceres","Toledo-hasta-Cáceres",265,{"$f":"VLOOKUP(A2482,Municipios!$B$2:$B$223,1,FALSE)","v":"Toledo"}]
["Valencia","Cáceres","Valencia-hasta-Cáceres",707,{"$f":"VLOOKUP(A2483,Municipios!$B$2:$B$223,1,FALSE)","v":"Valencia"}]
["Vitoria-Gasteiz","Cáceres","Vitoria-Gasteiz-hasta-Cáceres",562,{"$f":"VLOOKUP(A2484,Municipios!$B$2:$B$223,1,FALSE)","v":"Vitoria-Gasteiz"}]
["Zaragoza","Cáceres","Zaragoza-hasta-Cáceres",619,{"$f":"VLOOKUP(A2485,Municipios!$B$2:$B$223,1,FALSE)","v":"Zaragoza"}]
["Salamanca","Cáceres","Salamanca-hasta-Cáceres",212,{"$f":"VLOOKUP(A2486,Municipios!$B$2:$B$223,1,FALSE)","v":"Salamanca"}]
["Lugo","Cáceres","Lugo-hasta-Cáceres",578,{"$f":"VLOOKUP(A2487,Municipios!$B$2:$B$223,1,FALSE)","v":"Lugo"}]
["Valladolid","Cáceres","Valladolid-hasta-Cáceres",332,{"$f":"VLOOKUP(A2488,Municipios!$B$2:$B$223,1,FALSE)","v":"Valladolid"}]
["Jaén","Cáceres","Jaén-hasta-Cáceres",463,{"$f":"VLOOKUP(A2489,Municipios!$B$2:$B$223,1,FALSE)","v":"Jaén"}]
["Cádiz","Cáceres","Cádiz-hasta-Cáceres",374,{"$f":"VLOOKUP(A2490,Municipios!$B$2:$B$223,1,FALSE)","v":"Cádiz"}]
["Castellón de la Plana/Castelló de la Plana","Cáceres","Castellón de la Plana/Castelló de la Plana-hasta-Cáceres",758,{"$f":"VLOOKUP(A2491,Municipios!$B$2:$B$223,1,FALSE)","v":"Castellón de la Plana/Castelló de la Plana"}]
["Ciudad Real","Cáceres","Ciudad Real-hasta-Cáceres",295,{"$f":"VLOOKUP(A2492,Municipios!$B$2:$B$223,1,FALSE)","v":"Ciudad Real"}]
["Córdoba","Cáceres","Córdoba-hasta-Cáceres",322,{"$f":"VLOOKUP(A2493,Municipios!$B$2:$B$223,1,FALSE)","v":"Córdoba"}]
["Coruña (A)","Cáceres","Coruña (A)-hasta-Cáceres",669,{"$f":"VLOOKUP(A2494,Municipios!$B$2:$B$223,1,FALSE)","v":"Coruña (A)"}]
["Cuenca","Cáceres",{"$f":"CONCATENATE(A2495,\"-hasta-\",B2495)","v":"Cuenca-hasta-Cáceres"},441,{"$f":"VLOOKUP(A2495,Municipios!$B$2:$B$223,1,FALSE)","v":"Cuenca"}]
["Girona","Cáceres","Girona-hasta-Cáceres",1001,{"$f":"VLOOKUP(A2496,Municipios!$B$2:$B$223,1,FALSE)","v":"Girona"}]
["Granada","Cáceres","Granada-hasta-Cáceres",553,{"$f":"VLOOKUP(A2497,Municipios!$B$2:$B$223,1,FALSE)","v":"Granada"}]
["Guadalajara","Cáceres","Guadalajara-hasta-Cáceres",358,{"$f":"VLOOKUP(A2498,Municipios!$B$2:$B$223,1,FALSE)","v":"Guadalajara"}]
["Madrid","Cáceres","Madrid-hasta-Cáceres",297,{"$f":"VLOOKUP(A2499,Municipios!$B$2:$B$223,1,FALSE)","v":"Madrid"}]
["Huesca","Cáceres","Huesca-hasta-Cáceres",689,{"$f":"VLOOKUP(A2500,Municipios!$B$2:$B$223,1,FALSE)","v":"Huesca"}]
["Pontevedra","Cáceres","Pontevedra-hasta-Cáceres",658,{"$f":"VLOOKUP(A2501,Municipios!$B$2:$B$223,1,FALSE)","v":"Pontevedra"}]
["León","Cáceres","León-hasta-Cáceres",413,{"$f":"VLOOKUP(A2502,Municipios!$B$2:$B$223,1,FALSE)","v":"León"}]
["Logroño","Cáceres","Logroño-hasta-Cáceres",479,{"$f":"VLOOKUP(A2503,Municipios!$B$2:$B$223,1,FALSE)","v":"Logroño"}]
["Lleida","Cáceres","Lleida-hasta-Cáceres",779,{"$f":"VLOOKUP(A2504,Municipios!$B$2:$B$223,1,FALSE)","v":"Lleida"}]
["Málaga","Cáceres","Málaga-hasta-Cáceres",461,{"$f":"VLOOKUP(A2505,Municipios!$B$2:$B$223,1,FALSE)","v":"Málaga"}]
["Murcia","Cáceres","Murcia-hasta-Cáceres",655,{"$f":"VLOOKUP(A2506,Municipios!$B$2:$B$223,1,FALSE)","v":"Murcia"}]
["Ourense","Cáceres","Ourense-hasta-Cáceres",570,{"$f":"VLOOKUP(A2507,Municipios!$B$2:$B$223,1,FALSE)","v":"Ourense"}]
["Oviedo","Cáceres","Oviedo-hasta-Cáceres",532,{"$f":"VLOOKUP(A2508,Municipios!$B$2:$B$223,1,FALSE)","v":"Oviedo"}]
["Palencia","Cáceres","Palencia-hasta-Cáceres",375,{"$f":"VLOOKUP(A2509,Municipios!$B$2:$B$223,1,FALSE)","v":"Palencia"}]
["Pamplona/Iruña","Cáceres","Pamplona/Iruña-hasta-Cáceres",652,{"$f":"VLOOKUP(A2510,Municipios!$B$2:$B$223,1,FALSE)","v":"Pamplona/Iruña"}]
["Huelva","Cáceres","Huelva-hasta-Cáceres",346,{"$f":"VLOOKUP(A2511,Municipios!$B$2:$B$223,1,FALSE)","v":"Huelva"}]
["Logroño","San Sebastián","Logroño-hasta-San Sebastián",206,{"$f":"VLOOKUP(A2512,Municipios!$B$2:$B$223,1,FALSE)","v":"Logroño"}]
["San Sebastián","Logroño","San Sebastián-hasta-Logroño",206,{"$f":"VLOOKUP(A2513,Municipios!$B$2:$B$223,1,FALSE)","v":"San Sebastián"}]